﻿2026-07-31T05:55:50.9377902Z Current runner version: '2.336.0'
2026-07-31T05:55:50.9382766Z Runner name: 'hfenduleam'
2026-07-31T05:55:50.9383239Z Runner group name: 'Default'
2026-07-31T05:55:50.9383739Z Machine name: 'HFENDULEAM'
2026-07-31T05:55:50.9386939Z ##[group]GITHUB_TOKEN Permissions
2026-07-31T05:55:50.9388498Z Actions: write
2026-07-31T05:55:50.9388837Z ArtifactMetadata: write
2026-07-31T05:55:50.9389201Z Attestations: write
2026-07-31T05:55:50.9389529Z Checks: write
2026-07-31T05:55:50.9389843Z CodeQuality: write
2026-07-31T05:55:50.9390237Z Contents: write
2026-07-31T05:55:50.9390615Z CopilotRequests: write
2026-07-31T05:55:50.9390947Z Deployments: write
2026-07-31T05:55:50.9391266Z Discussions: write
2026-07-31T05:55:50.9391594Z Drives: write
2026-07-31T05:55:50.9391924Z Issues: write
2026-07-31T05:55:50.9392225Z Metadata: read
2026-07-31T05:55:50.9392529Z Models: read
2026-07-31T05:55:50.9392860Z Packages: write
2026-07-31T05:55:50.9393194Z Pages: write
2026-07-31T05:55:50.9393687Z PullRequests: write
2026-07-31T05:55:50.9394081Z RepositoryProjects: write
2026-07-31T05:55:50.9394443Z SecurityEvents: write
2026-07-31T05:55:50.9394775Z Statuses: write
2026-07-31T05:55:50.9395076Z VulnerabilityAlerts: read
2026-07-31T05:55:50.9395430Z ##[endgroup]
2026-07-31T05:55:50.9396818Z Secret source: Actions
2026-07-31T05:55:50.9397437Z Prepare workflow directory
2026-07-31T05:55:51.0254189Z Prepare all required actions
2026-07-31T05:55:51.0285747Z Getting action download info
2026-07-31T05:55:51.3247787Z Download action repository 'actions/checkout@v5' (SHA:fbc6f3992d24b796d5a048ff273f7fcc4a7b6c09)
2026-07-31T05:55:52.0009625Z Complete job name: unit (self-hosted, Windows, hfenduleam)
2026-07-31T05:55:52.2494489Z ##[group]Run $floorBytes = 32GB
2026-07-31T05:55:52.2495162Z [36;1m$floorBytes = 32GB[0m
2026-07-31T05:55:52.2495751Z [36;1m$drive = (Get-Item $env:GITHUB_WORKSPACE).PSDrive[0m
2026-07-31T05:55:52.2496411Z [36;1m$freeBytes = [int64]$drive.Free[0m
2026-07-31T05:55:52.2497331Z [36;1mWrite-Host "disk preflight: drive=$($drive.Root) free_bytes=$freeBytes floor_bytes=$floorBytes"[0m
2026-07-31T05:55:52.2498284Z [36;1mif ($freeBytes -lt $floorBytes) {[0m
2026-07-31T05:55:52.2499175Z [36;1m  Write-Error "RESOURCE=disk drive=$($drive.Root) free_bytes=$freeBytes floor_bytes=$floorBytes"[0m
2026-07-31T05:55:52.2500038Z [36;1m  exit 1[0m
2026-07-31T05:55:52.2500399Z [36;1m}[0m
2026-07-31T05:55:52.2510584Z shell: C:\Program Files\PowerShell\7\pwsh.EXE -command ". '{0}'"
2026-07-31T05:55:52.2511550Z ##[endgroup]
2026-07-31T05:55:52.5248619Z disk preflight: drive=C:\ free_bytes=114566434816 floor_bytes=34359738368
2026-07-31T05:55:52.8151360Z ##[group]Run actions/checkout@v5
2026-07-31T05:55:52.8151820Z with:
2026-07-31T05:55:52.8152101Z   repository: BigscreenVR/spt-bs-core
2026-07-31T05:55:52.8154961Z   token: ***
2026-07-31T05:55:52.8155227Z   ssh-strict: true
2026-07-31T05:55:52.8155500Z   ssh-user: git
2026-07-31T05:55:52.8155773Z   persist-credentials: true
2026-07-31T05:55:52.8156097Z   clean: true
2026-07-31T05:55:52.8156370Z   sparse-checkout-cone-mode: true
2026-07-31T05:55:52.8156695Z   fetch-depth: 1
2026-07-31T05:55:52.8156958Z   fetch-tags: false
2026-07-31T05:55:52.8157233Z   show-progress: true
2026-07-31T05:55:52.8157501Z   lfs: false
2026-07-31T05:55:52.8157756Z   submodules: false
2026-07-31T05:55:52.8158038Z   set-safe-directory: true
2026-07-31T05:55:52.8158349Z   allow-unsafe-pr-checkout: false
2026-07-31T05:55:52.8158672Z ##[endgroup]
2026-07-31T05:55:53.1274609Z Syncing repository: BigscreenVR/spt-bs-core
2026-07-31T05:55:53.1275724Z ##[group]Getting Git version info
2026-07-31T05:55:53.1276259Z Working directory is 'C:\actions-runner\_work\spt-bs-core\spt-bs-core'
2026-07-31T05:55:53.1511854Z [command]"C:\Program Files\Git\cmd\git.exe" version
2026-07-31T05:55:53.1753779Z git version 2.43.0.windows.1
2026-07-31T05:55:53.1777932Z ##[endgroup]
2026-07-31T05:55:53.1786260Z Copying 'C:\Users\decid\.gitconfig' to 'C:\actions-runner\_work\_temp\7791a31a-79f9-4523-9a3c-87ddda4b6937\.gitconfig'
2026-07-31T05:55:53.1800053Z Temporarily overriding HOME='C:\actions-runner\_work\_temp\7791a31a-79f9-4523-9a3c-87ddda4b6937' before making global git config changes
2026-07-31T05:55:53.1801177Z Adding repository directory to the temporary git global config as a safe directory
2026-07-31T05:55:53.1805100Z [command]"C:\Program Files\Git\cmd\git.exe" config --global --add safe.directory C:\actions-runner\_work\spt-bs-core\spt-bs-core
2026-07-31T05:55:53.2087653Z [command]"C:\Program Files\Git\cmd\git.exe" config --local --get remote.origin.url
2026-07-31T05:55:53.2370706Z https://github.com/BigscreenVR/spt-bs-core
2026-07-31T05:55:53.2408153Z ##[group]Removing previously created refs, to avoid conflicts
2026-07-31T05:55:53.2413076Z [command]"C:\Program Files\Git\cmd\git.exe" rev-parse --symbolic-full-name --verify --quiet HEAD
2026-07-31T05:55:53.2674229Z refs/heads/main
2026-07-31T05:55:53.2698426Z [command]"C:\Program Files\Git\cmd\git.exe" checkout --detach
2026-07-31T05:55:53.3393082Z HEAD is now at d7411f9b docs: Phase E rulings — Proposal 0 accepted, N1-N6 binding at mint, enactment scope clarified
2026-07-31T05:55:53.3719178Z ##[endgroup]
2026-07-31T05:55:53.3724419Z [command]"C:\Program Files\Git\cmd\git.exe" submodule status
2026-07-31T05:55:54.3640900Z ##[group]Cleaning the repository
2026-07-31T05:55:54.3643870Z [command]"C:\Program Files\Git\cmd\git.exe" clean -ffdx
2026-07-31T05:56:02.5644268Z Removing target/
2026-07-31T05:56:02.5677450Z [command]"C:\Program Files\Git\cmd\git.exe" reset --hard HEAD
2026-07-31T05:56:02.9416284Z HEAD is now at d7411f9b docs: Phase E rulings — Proposal 0 accepted, N1-N6 binding at mint, enactment scope clarified
2026-07-31T05:56:02.9450948Z ##[endgroup]
2026-07-31T05:56:02.9455645Z ##[group]Disabling automatic garbage collection
2026-07-31T05:56:02.9460931Z [command]"C:\Program Files\Git\cmd\git.exe" config --local gc.auto 0
2026-07-31T05:56:02.9835543Z ##[endgroup]
2026-07-31T05:56:02.9835936Z ##[group]Setting up auth
2026-07-31T05:56:02.9843253Z [command]"C:\Program Files\Git\cmd\git.exe" config --local --name-only --get-regexp core\.sshCommand
2026-07-31T05:56:03.0135031Z [command]"C:\Program Files\Git\cmd\git.exe" submodule foreach --recursive "sh -c \"git config --local --name-only --get-regexp 'core\.sshCommand' && git config --local --unset-all 'core.sshCommand' || :\""
2026-07-31T05:56:03.7837978Z [command]"C:\Program Files\Git\cmd\git.exe" config --local --name-only --get-regexp http\.https\:\/\/github\.com\/\.extraheader
2026-07-31T05:56:03.8149327Z [command]"C:\Program Files\Git\cmd\git.exe" submodule foreach --recursive "sh -c \"git config --local --name-only --get-regexp 'http\.https\:\/\/github\.com\/\.extraheader' && git config --local --unset-all 'http.https://github.com/.extraheader' || :\""
2026-07-31T05:56:04.4443160Z [command]"C:\Program Files\Git\cmd\git.exe" config --local --name-only --get-regexp ^includeIf\.gitdir:
2026-07-31T05:56:04.6457115Z [command]"C:\Program Files\Git\cmd\git.exe" submodule foreach --recursive "git config --local --show-origin --name-only --get-regexp remote.origin.url"
2026-07-31T05:56:05.2926716Z [command]"C:\Program Files\Git\cmd\git.exe" config --local http.https://github.com/.extraheader "AUTHORIZATION: basic ***"
2026-07-31T05:56:05.3311289Z ##[endgroup]
2026-07-31T05:56:05.3311819Z ##[group]Fetching the repository
2026-07-31T05:56:05.3320359Z [command]"C:\Program Files\Git\cmd\git.exe" -c protocol.version=2 fetch --no-tags --prune --no-recurse-submodules --depth=1 origin +ae843b1d9abdf3af64e0178cac521f7ed2189667:refs/remotes/pull/132/merge
2026-07-31T05:56:06.3911199Z From https://github.com/BigscreenVR/spt-bs-core
2026-07-31T05:56:06.3911780Z  + ad9d1d52...ae843b1d ae843b1d9abdf3af64e0178cac521f7ed2189667 -> pull/132/merge  (forced update)
2026-07-31T05:56:06.4067015Z ##[endgroup]
2026-07-31T05:56:06.4067365Z ##[group]Determining the checkout info
2026-07-31T05:56:06.4069647Z ##[endgroup]
2026-07-31T05:56:06.4076954Z [command]"C:\Program Files\Git\cmd\git.exe" sparse-checkout disable
2026-07-31T05:56:06.4410661Z [command]"C:\Program Files\Git\cmd\git.exe" config --local --unset-all extensions.worktreeConfig
2026-07-31T05:56:06.4683364Z ##[group]Checking out the ref
2026-07-31T05:56:06.4687990Z [command]"C:\Program Files\Git\cmd\git.exe" checkout --progress --force refs/remotes/pull/132/merge
2026-07-31T05:56:06.5893479Z Previous HEAD position was d7411f9b docs: Phase E rulings — Proposal 0 accepted, N1-N6 binding at mint, enactment scope clarified
2026-07-31T05:56:06.5894185Z HEAD is now at ae843b1d Merge 37e8276b840dfb85defd4e3f49ef6f87f61614c3 into d7411f9b9b78bba10bcfcd3c5b06f937b9f1a1c0
2026-07-31T05:56:06.5920700Z ##[endgroup]
2026-07-31T05:56:06.6253610Z [command]"C:\Program Files\Git\cmd\git.exe" log -1 --format=%H
2026-07-31T05:56:06.6617210Z ae843b1d9abdf3af64e0178cac521f7ed2189667
2026-07-31T05:56:06.7571186Z ##[group]Run cargo build -p spt --bin translate_proof_fixture
2026-07-31T05:56:06.7571508Z [36;1mcargo build -p spt --bin translate_proof_fixture[0m
2026-07-31T05:56:06.7576586Z shell: C:\Program Files\PowerShell\7\pwsh.EXE -command ". '{0}'"
2026-07-31T05:56:06.7576803Z ##[endgroup]
2026-07-31T05:56:07.9495378Z    Compiling proc-macro2 v1.0.106
2026-07-31T05:56:07.9495695Z    Compiling quote v1.0.45
2026-07-31T05:56:07.9495936Z    Compiling unicode-ident v1.0.24
2026-07-31T05:56:07.9496276Z    Compiling cfg-if v1.0.4
2026-07-31T05:56:07.9497355Z    Compiling serde_core v1.0.228
2026-07-31T05:56:07.9497605Z    Compiling serde v1.0.228
2026-07-31T05:56:07.9497966Z    Compiling windows-link v0.2.1
2026-07-31T05:56:07.9498325Z    Compiling typenum v1.20.1
2026-07-31T05:56:07.9498612Z    Compiling getrandom v0.3.4
2026-07-31T05:56:07.9498867Z    Compiling pin-project-lite v0.2.17
2026-07-31T05:56:07.9499283Z    Compiling version_check v0.9.5
2026-07-31T05:56:07.9499831Z    Compiling portable-atomic v1.13.1
2026-07-31T05:56:07.9500663Z    Compiling memchr v2.8.1
2026-07-31T05:56:07.9501289Z    Compiling shlex v2.0.1
2026-07-31T05:56:07.9501599Z    Compiling find-msvc-tools v0.1.9
2026-07-31T05:56:07.9502068Z    Compiling critical-section v1.2.0
2026-07-31T05:56:08.0737506Z    Compiling windows-sys v0.61.2
2026-07-31T05:56:08.0956185Z    Compiling subtle v2.6.1
2026-07-31T05:56:08.1686136Z    Compiling smallvec v1.15.1
2026-07-31T05:56:08.1686524Z    Compiling equivalent v1.0.2
2026-07-31T05:56:08.2432386Z    Compiling futures-core v0.3.32
2026-07-31T05:56:08.3380918Z    Compiling bytes v1.11.1
2026-07-31T05:56:08.5451500Z    Compiling itoa v1.0.18
2026-07-31T05:56:08.5451968Z    Compiling generic-array v0.14.7
2026-07-31T05:56:08.5452173Z    Compiling semver v1.0.28
2026-07-31T05:56:08.6012786Z    Compiling stable_deref_trait v1.2.1
2026-07-31T05:56:08.6138694Z    Compiling log v0.4.32
2026-07-31T05:56:08.7781263Z    Compiling rustc_version v0.4.1
2026-07-31T05:56:08.9836596Z    Compiling slab v0.4.12
2026-07-31T05:56:08.9836867Z    Compiling futures-sink v0.3.32
2026-07-31T05:56:09.0439102Z    Compiling futures-io v0.3.32
2026-07-31T05:56:09.0887371Z    Compiling rustversion v1.0.22
2026-07-31T05:56:09.1161366Z    Compiling futures-task v0.3.32
2026-07-31T05:56:09.2070941Z    Compiling hashbrown v0.17.1
2026-07-31T05:56:09.2736266Z    Compiling rand_core v0.10.1
2026-07-31T05:56:09.2909685Z    Compiling futures-channel v0.3.32
2026-07-31T05:56:09.3283417Z    Compiling getrandom v0.2.17
2026-07-31T05:56:09.3384094Z    Compiling cpufeatures v0.2.17
2026-07-31T05:56:09.4056301Z    Compiling getrandom v0.4.2
2026-07-31T05:56:09.4132853Z    Compiling fnv v1.0.7
2026-07-31T05:56:09.4340796Z    Compiling libc v0.2.186
2026-07-31T05:56:09.5411549Z    Compiling strsim v0.11.1
2026-07-31T05:56:09.6450257Z    Compiling cfg_aliases v0.2.1
2026-07-31T05:56:09.8473274Z    Compiling litemap v0.8.2
2026-07-31T05:56:09.9092426Z    Compiling autocfg v1.5.1
2026-07-31T05:56:09.9092753Z    Compiling writeable v0.6.3
2026-07-31T05:56:09.9636762Z    Compiling jobserver v0.1.34
2026-07-31T05:56:10.0481551Z    Compiling icu_properties_data v2.2.0
2026-07-31T05:56:10.0769317Z    Compiling icu_normalizer_data v2.2.0
2026-07-31T05:56:10.0769775Z    Compiling dunce v1.0.5
2026-07-31T05:56:10.1205560Z    Compiling utf8_iter v1.0.4
2026-07-31T05:56:10.4153357Z    Compiling cc v1.2.63
2026-07-31T05:56:10.4475724Z    Compiling indexmap v2.14.0
2026-07-31T05:56:10.4771528Z    Compiling fs_extra v1.3.0
2026-07-31T05:56:10.5530267Z    Compiling crypto-common v0.1.7
2026-07-31T05:56:10.6170200Z    Compiling ident_case v1.0.1
2026-07-31T05:56:10.6383549Z    Compiling syn v2.0.117
2026-07-31T05:56:10.6820722Z    Compiling percent-encoding v2.3.2
2026-07-31T05:56:10.7038035Z    Compiling http v1.4.1
2026-07-31T05:56:10.7588182Z    Compiling cpufeatures v0.3.0
2026-07-31T05:56:10.8034326Z    Compiling unicode-segmentation v1.13.3
2026-07-31T05:56:10.8085268Z    Compiling thiserror v2.0.18
2026-07-31T05:56:10.8395066Z    Compiling aws-lc-rs v1.17.0
2026-07-31T05:56:10.9794517Z    Compiling scopeguard v1.2.0
2026-07-31T05:56:11.0088507Z    Compiling form_urlencoded v1.2.2
2026-07-31T05:56:11.1601312Z    Compiling chacha20 v0.10.0
2026-07-31T05:56:11.1601757Z    Compiling block-buffer v0.10.4
2026-07-31T05:56:11.4652743Z    Compiling lock_api v0.4.14
2026-07-31T05:56:11.4653824Z    Compiling untrusted v0.9.0
2026-07-31T05:56:11.4977602Z    Compiling bitflags v2.12.1
2026-07-31T05:56:11.6546723Z    Compiling cmake v0.1.58
2026-07-31T05:56:11.6550047Z    Compiling winapi v0.3.9
2026-07-31T05:56:11.6556913Z    Compiling digest v0.10.7
2026-07-31T05:56:11.6557950Z    Compiling num-traits v0.2.19
2026-07-31T05:56:11.7211751Z    Compiling rand v0.10.1
2026-07-31T05:56:11.8354283Z    Compiling windows-result v0.4.1
2026-07-31T05:56:11.8759241Z    Compiling windows-strings v0.5.1
2026-07-31T05:56:11.8760647Z    Compiling rustls v0.23.40
2026-07-31T05:56:11.9242411Z    Compiling heck v0.5.0
2026-07-31T05:56:12.0073889Z    Compiling convert_case v0.10.0
2026-07-31T05:56:12.0165730Z    Compiling const-oid v0.10.2
2026-07-31T05:56:12.3188190Z    Compiling atomic-waker v1.1.2
2026-07-31T05:56:12.4511807Z    Compiling unicode-xid v0.2.6
2026-07-31T05:56:12.5431612Z    Compiling anyhow v1.0.102
2026-07-31T05:56:12.5431969Z    Compiling httparse v1.10.1
2026-07-31T05:56:12.5997159Z    Compiling parking_lot_core v0.9.12
2026-07-31T05:56:12.6492072Z    Compiling zerocopy v0.8.50
2026-07-31T05:56:12.6492388Z    Compiling http-body v1.0.1
2026-07-31T05:56:12.6672919Z    Compiling curve25519-dalek v4.1.3
2026-07-31T05:56:12.6799059Z    Compiling hybrid-array v0.4.12
2026-07-31T05:56:12.7087176Z    Compiling ahash v0.8.12
2026-07-31T05:56:12.7087924Z    Compiling powerfmt v0.2.0
2026-07-31T05:56:12.7202665Z    Compiling either v1.16.0
2026-07-31T05:56:12.8325328Z    Compiling base64ct v1.8.3
2026-07-31T05:56:12.8800267Z    Compiling uuid v1.23.2
2026-07-31T05:56:13.0204055Z    Compiling aws-lc-sys v0.41.0
2026-07-31T05:56:13.0744532Z    Compiling ring v0.17.14
2026-07-31T05:56:13.5752006Z    Compiling pem-rfc7468 v1.0.0
2026-07-31T05:56:13.6035075Z    Compiling deranged v0.5.8
2026-07-31T05:56:13.6336460Z    Compiling rand_core v0.6.4
2026-07-31T05:56:13.7771971Z    Compiling tower-service v0.3.3
2026-07-31T05:56:13.9017467Z    Compiling vcpkg v0.2.15
2026-07-31T05:56:14.0011966Z    Compiling num-conv v0.2.2
2026-07-31T05:56:15.2719979Z    Compiling base64 v0.22.1
2026-07-31T05:56:15.3494687Z    Compiling pkg-config v0.3.33
2026-07-31T05:56:15.3649702Z    Compiling try-lock v0.2.5
2026-07-31T05:56:15.3684966Z    Compiling tinyvec_macros v0.1.1
2026-07-31T05:56:15.4352511Z    Compiling data-encoding v2.11.0
2026-07-31T05:56:15.4475588Z    Compiling time-core v0.1.8
2026-07-31T05:56:15.5196230Z    Compiling zmij v1.0.21
2026-07-31T05:56:15.5396488Z    Compiling fastrand v2.4.1
2026-07-31T05:56:15.7276157Z    Compiling synstructure v0.13.2
2026-07-31T05:56:15.8608070Z    Compiling darling_core v0.20.11
2026-07-31T05:56:15.9033481Z    Compiling tinyvec v1.11.0
2026-07-31T05:56:15.9785779Z    Compiling socket2 v0.6.4
2026-07-31T05:56:16.1841749Z    Compiling mio v1.2.1
2026-07-31T05:56:16.2252387Z    Compiling libsqlite3-sys v0.30.1
2026-07-31T05:56:16.4033366Z    Compiling want v0.3.1
2026-07-31T05:56:16.6365631Z    Compiling parking_lot v0.12.5
2026-07-31T05:56:16.6390579Z    Compiling crypto-common v0.2.2
2026-07-31T05:56:16.9744776Z    Compiling block-buffer v0.12.0
2026-07-31T05:56:17.4138346Z    Compiling vergen-lib v9.1.0
2026-07-31T05:56:17.8271910Z    Compiling sha2 v0.10.9
2026-07-31T05:56:17.8532707Z    Compiling serde_derive v1.0.228
2026-07-31T05:56:17.9302696Z    Compiling zeroize_derive v1.4.3
2026-07-31T05:56:18.0877629Z    Compiling zerofrom-derive v0.1.7
2026-07-31T05:56:18.2690196Z    Compiling yoke-derive v0.8.2
2026-07-31T05:56:18.9160711Z    Compiling tokio-macros v2.7.0
2026-07-31T05:56:18.9161866Z    Compiling futures-macro v0.3.32
2026-07-31T05:56:19.0245484Z    Compiling zerovec-derive v0.11.3
2026-07-31T05:56:20.2767857Z    Compiling displaydoc v0.2.6
2026-07-31T05:56:20.3220717Z    Compiling tracing-attributes v0.1.31
2026-07-31T05:56:20.3522877Z    Compiling thiserror-impl v2.0.18
2026-07-31T05:56:20.3523495Z    Compiling curve25519-dalek-derive v0.1.1
2026-07-31T05:56:20.7220275Z    Compiling darling_macro v0.20.11
2026-07-31T05:56:20.9400391Z    Compiling derive_more-impl v2.1.1
2026-07-31T05:56:21.0616082Z    Compiling windows-implement v0.60.2
2026-07-31T05:56:21.1510423Z    Compiling zeroize v1.8.2
2026-07-31T05:56:21.2650204Z    Compiling tokio v1.52.3
2026-07-31T05:56:21.6152607Z    Compiling futures-util v0.3.32
2026-07-31T05:56:21.6289791Z    Compiling n0-error-macros v0.1.3
2026-07-31T05:56:21.6513417Z    Compiling windows-interface v0.59.3
2026-07-31T05:56:21.6619915Z    Compiling spez v0.1.2
2026-07-31T05:56:21.6766858Z    Compiling darling v0.20.11
2026-07-31T05:56:21.8274440Z    Compiling pin-project-internal v1.1.13
2026-07-31T05:56:21.8398000Z    Compiling zerofrom v0.1.8
2026-07-31T05:56:22.0482926Z    Compiling rustls-pki-types v1.14.1
2026-07-31T05:56:22.6479061Z    Compiling der v0.8.0-rc.10
2026-07-31T05:56:23.7030098Z    Compiling inout v0.1.4
2026-07-31T05:56:23.8821931Z    Compiling windows-core v0.62.2
2026-07-31T05:56:23.9257311Z    Compiling derive_builder_core v0.20.2
2026-07-31T05:56:24.0457875Z    Compiling n0-error v0.1.3
2026-07-31T05:56:24.6299422Z    Compiling n0-future v0.3.2
2026-07-31T05:56:25.5089846Z    Compiling yoke v0.8.3
2026-07-31T05:56:25.5175205Z    Compiling tokio-util v0.7.18
2026-07-31T05:56:25.8327311Z    Compiling serde_json v1.0.150
2026-07-31T05:56:25.8615565Z    Compiling windows_x86_64_msvc v0.52.6
2026-07-31T05:56:25.9231679Z    Compiling zerovec v0.11.6
2026-07-31T05:56:26.1980584Z    Compiling zerotrie v0.2.4
2026-07-31T05:56:26.1980929Z    Compiling derive_more v2.1.1
2026-07-31T05:56:26.3262447Z    Compiling httpdate v1.0.3
2026-07-31T05:56:26.5635326Z    Compiling ipnet v2.12.0
2026-07-31T05:56:26.5635634Z    Compiling crossbeam-utils v0.8.21
2026-07-31T05:56:26.7235605Z    Compiling tinystr v0.8.3
2026-07-31T05:56:26.8307502Z    Compiling potential_utf v0.1.5
2026-07-31T05:56:26.8308081Z    Compiling winnow v1.0.3
2026-07-31T05:56:26.8308300Z    Compiling signature v2.2.0
2026-07-31T05:56:26.9183865Z    Compiling cordyceps v0.3.4
2026-07-31T05:56:26.9326078Z    Compiling parking v2.2.1
2026-07-31T05:56:27.0544926Z    Compiling once_cell v1.21.4
2026-07-31T05:56:27.1171618Z    Compiling icu_locale_core v2.2.0
2026-07-31T05:56:27.1430370Z    Compiling icu_collections v2.2.0
2026-07-31T05:56:27.3034622Z    Compiling derive_builder_macro v0.20.2
2026-07-31T05:56:27.3035003Z    Compiling diatomic-waker v0.2.3
2026-07-31T05:56:27.3556422Z    Compiling spin v0.10.0
2026-07-31T05:56:27.3556744Z    Compiling futures-lite v2.6.1
2026-07-31T05:56:27.4045969Z    Compiling ed25519 v2.2.3
2026-07-31T05:56:27.5398185Z    Compiling tracing-core v0.1.36
2026-07-31T05:56:27.9185792Z    Compiling futures-buffered v0.2.13
2026-07-31T05:56:27.9770681Z    Compiling spki v0.8.0-rc.4
2026-07-31T05:56:28.4460783Z    Compiling pin-project v1.1.13
2026-07-31T05:56:28.4992532Z    Compiling icu_provider v2.2.0
2026-07-31T05:56:28.7196794Z    Compiling hashbrown v0.14.5
2026-07-31T05:56:28.7197186Z    Compiling toml_parser v1.1.2+spec-1.1.0
2026-07-31T05:56:28.7197607Z    Compiling cipher v0.4.4
2026-07-31T05:56:28.8172726Z    Compiling tracing v0.1.44
2026-07-31T05:56:28.8657257Z    Compiling derive_builder v0.20.2
2026-07-31T05:56:28.9321182Z    Compiling digest v0.11.3
2026-07-31T05:56:29.1622081Z    Compiling vergen-lib v0.1.6
2026-07-31T05:56:29.2230687Z    Compiling icu_normalizer v2.2.0
2026-07-31T05:56:29.2574862Z    Compiling icu_properties v2.2.0
2026-07-31T05:56:29.2684811Z    Compiling vergen v9.1.0
2026-07-31T05:56:29.3278767Z    Compiling universal-hash v0.5.1
2026-07-31T05:56:29.3651190Z    Compiling noq-udp v0.10.0
2026-07-31T05:56:29.5813106Z    Compiling curve25519-dalek v5.0.0-pre.6
2026-07-31T05:56:29.5906345Z    Compiling heapless v0.7.17
2026-07-31T05:56:29.6370662Z    Compiling sync_wrapper v1.0.2
2026-07-31T05:56:29.7472772Z    Compiling h2 v0.4.14
2026-07-31T05:56:29.7772345Z    Compiling byteorder v1.5.0
2026-07-31T05:56:29.7969721Z    Compiling opaque-debug v0.3.1
2026-07-31T05:56:29.8334168Z    Compiling allocator-api2 v0.2.21
2026-07-31T05:56:29.8431697Z    Compiling toml_datetime v1.1.1+spec-1.1.0
2026-07-31T05:56:30.0625294Z    Compiling polyval v0.6.2
2026-07-31T05:56:30.3770253Z    Compiling toml_edit v0.25.12+spec-1.1.0
2026-07-31T05:56:30.3925665Z    Compiling hash32 v0.2.1
2026-07-31T05:56:30.4110020Z    Compiling hashlink v0.9.1
2026-07-31T05:56:30.5948246Z    Compiling idna_adapter v1.2.2
2026-07-31T05:56:30.6177275Z    Compiling pkcs8 v0.11.0-rc.10
2026-07-31T05:56:30.9307222Z    Compiling ed25519-dalek v2.2.0
2026-07-31T05:56:31.0503987Z    Compiling prefix-trie v0.8.4
2026-07-31T05:56:31.0512224Z    Compiling futures-executor v0.3.32
2026-07-31T05:56:31.0515618Z    Compiling vergen-gitcl v1.0.8
2026-07-31T05:56:31.1139561Z    Compiling spin v0.9.8
2026-07-31T05:56:31.1155825Z    Compiling windows-threading v0.2.1
2026-07-31T05:56:31.2046764Z    Compiling idna v1.1.0
2026-07-31T05:56:31.2114811Z    Compiling ryu v1.0.23
2026-07-31T05:56:31.2587113Z    Compiling signature v3.0.0
2026-07-31T05:56:31.2587375Z    Compiling fallible-iterator v0.3.0
2026-07-31T05:56:31.4499569Z    Compiling fallible-streaming-iterator v0.1.9
2026-07-31T05:56:31.7593806Z    Compiling tower-layer v0.3.3
2026-07-31T05:56:31.8060801Z    Compiling windows-future v0.3.2
2026-07-31T05:56:32.0453267Z    Compiling url v2.5.8
2026-07-31T05:56:32.0455914Z    Compiling ed25519 v3.0.0-rc.4
2026-07-31T05:56:32.0477550Z    Compiling futures v0.3.32
2026-07-31T05:56:32.1439263Z    Compiling proc-macro-crate v3.5.0
2026-07-31T05:56:32.1439853Z    Compiling spt-proto v0.47.0 (C:\actions-runner\_work\spt-bs-core\spt-bs-core\crates\spt-proto)
2026-07-31T05:56:32.1521870Z    Compiling windows-targets v0.52.6
2026-07-31T05:56:32.6364873Z    Compiling hickory-proto v0.26.0-beta.4
2026-07-31T05:56:32.6978727Z    Compiling ghash v0.5.1
2026-07-31T05:56:32.7507887Z    Compiling sha2 v0.11.0-rc.5
2026-07-31T05:56:32.7711421Z    Compiling data-encoding-macro-internal v0.1.18
2026-07-31T05:56:32.9139198Z    Compiling aes v0.8.4
2026-07-31T05:56:32.9395481Z    Compiling ctr v0.9.2
2026-07-31T05:56:32.9616798Z    Compiling windows-collections v0.3.2
2026-07-31T05:56:32.9866633Z    Compiling windows-numerics v0.3.1
2026-07-31T05:56:32.9866999Z    Compiling cobs v0.3.0
2026-07-31T05:56:33.0870665Z    Compiling rusqlite v0.32.1
2026-07-31T05:56:33.1277724Z    Compiling postcard-derive v0.2.2
2026-07-31T05:56:33.3709829Z    Compiling time v0.3.47
2026-07-31T05:56:33.3781046Z    Compiling fs2 v0.4.3
2026-07-31T05:56:33.7595533Z    Compiling hyper v1.10.1
2026-07-31T05:56:33.9463152Z    Compiling http-body-util v0.1.3
2026-07-31T05:56:34.0378407Z    Compiling aead v0.5.2
2026-07-31T05:56:34.0487960Z    Compiling arrayvec v0.7.6
2026-07-31T05:56:34.1911036Z    Compiling widestring v1.2.1
2026-07-31T05:56:34.3218603Z    Compiling ipconfig v0.3.4
2026-07-31T05:56:34.3907645Z    Compiling utf8parse v0.2.2
2026-07-31T05:56:34.6232304Z    Compiling windows v0.62.2
2026-07-31T05:56:34.7811140Z    Compiling data-encoding-macro v0.1.20
2026-07-31T05:56:35.2566621Z    Compiling ed25519-dalek v3.0.0-pre.6
2026-07-31T05:56:36.0652847Z    Compiling num_enum_derive v0.7.6
2026-07-31T05:56:36.2621027Z    Compiling postcard v1.1.3
2026-07-31T05:56:36.2937549Z    Compiling spt-store v0.47.0 (C:\actions-runner\_work\spt-bs-core\spt-bs-core\crates\spt-store)
2026-07-31T05:56:36.5703700Z    Compiling windows-sys v0.59.0
2026-07-31T05:56:36.6770225Z    Compiling tower v0.5.3
2026-07-31T05:56:36.9104382Z    Compiling aes-gcm v0.10.3
2026-07-31T05:56:37.2865537Z    Compiling hyper-util v0.1.20
2026-07-31T05:56:37.8549374Z    Compiling crossbeam-channel v0.5.15
2026-07-31T05:56:38.4992496Z    Compiling crossbeam-epoch v0.9.18
2026-07-31T05:56:38.5487646Z    Compiling chrono v0.4.45
2026-07-31T05:56:38.7009404Z    Compiling async-trait v0.1.89
2026-07-31T05:56:38.8122001Z    Compiling enum-assoc v1.3.0
2026-07-31T05:56:38.8190903Z    Compiling strum_macros v0.28.0
2026-07-31T05:56:38.9717049Z    Compiling iroh-metrics-derive v0.4.1
2026-07-31T05:56:39.0662937Z    Compiling blake3 v1.8.5
2026-07-31T05:56:39.1455207Z    Compiling windows-registry v0.6.1
2026-07-31T05:56:39.4024467Z    Compiling memoffset v0.6.5
2026-07-31T05:56:39.7119537Z    Compiling noq v0.18.0
2026-07-31T05:56:40.0175659Z    Compiling netwatch v0.16.0
2026-07-31T05:56:40.0494595Z    Compiling acto v0.8.2
2026-07-31T05:56:40.1429222Z    Compiling xml-rs v0.8.28
2026-07-31T05:56:40.3534677Z    Compiling identity-hash v0.1.0
2026-07-31T05:56:40.3535078Z    Compiling sorted-index-buffer v0.2.1
2026-07-31T05:56:40.5285958Z    Compiling thiserror v1.0.69
2026-07-31T05:56:40.6345628Z    Compiling ref-cast v1.0.25
2026-07-31T05:56:40.6346040Z    Compiling rustc-hash v2.1.2
2026-07-31T05:56:40.8228432Z    Compiling lru-slab v0.1.2
2026-07-31T05:56:40.8228791Z    Compiling foldhash v0.2.0
2026-07-31T05:56:40.8711299Z    Compiling tagptr v0.2.0
2026-07-31T05:56:40.8977369Z    Compiling mac-addr v0.3.0
2026-07-31T05:56:41.1457117Z    Compiling xmltree v0.10.3
2026-07-31T05:56:41.1457454Z    Compiling hashbrown v0.16.1
2026-07-31T05:56:41.1758170Z    Compiling moka v0.12.15
2026-07-31T05:56:41.1759181Z    Compiling num_enum v0.7.6
2026-07-31T05:56:41.2921001Z    Compiling netdev v0.42.0
2026-07-31T05:56:42.1718757Z    Compiling iroh-metrics v0.38.3
2026-07-31T05:56:42.3364544Z    Compiling iroh-relay v0.98.0
2026-07-31T05:56:42.7253594Z    Compiling tower-http v0.6.11
2026-07-31T05:56:42.7351297Z    Compiling iroh-base v0.98.0
2026-07-31T05:56:42.7933522Z    Compiling strum v0.28.0
2026-07-31T05:56:42.7954570Z    Compiling attohttpc v0.30.1
2026-07-31T05:56:42.9132929Z    Compiling n0-watcher v0.6.1
2026-07-31T05:56:42.9197680Z    Compiling tokio-stream v0.1.18
2026-07-31T05:56:42.9591283Z    Compiling toml_datetime v0.6.11
2026-07-31T05:56:42.9942800Z    Compiling serde_spanned v0.6.9
2026-07-31T05:56:43.2971297Z    Compiling spt-msg v0.47.0 (C:\actions-runner\_work\spt-bs-core\spt-bs-core\crates\spt-msg)
2026-07-31T05:56:43.3236035Z    Compiling thiserror-impl v1.0.69
2026-07-31T05:56:43.5337439Z    Compiling ref-cast-impl v1.0.25
2026-07-31T05:56:43.7305634Z    Compiling serde_derive_internals v0.29.1
2026-07-31T05:56:43.8791641Z    Compiling simple-dns v0.9.3
2026-07-31T05:56:43.9587705Z    Compiling serial-core v0.4.0
2026-07-31T05:56:44.0392055Z    Compiling aho-corasick v1.1.4
2026-07-31T05:56:44.4251921Z    Compiling simdutf8 v0.1.5
2026-07-31T05:56:44.4443999Z    Compiling toml_write v0.1.2
2026-07-31T05:56:44.5327583Z    Compiling smol_str v0.1.24
2026-07-31T05:56:45.0546556Z    Compiling resolv-conf v0.7.6
2026-07-31T05:56:45.0884640Z    Compiling winnow v0.7.15
2026-07-31T05:56:45.3233961Z    Compiling winreg v0.10.1
2026-07-31T05:56:45.4311389Z    Compiling arrayref v0.3.9
2026-07-31T05:56:45.6323217Z    Compiling regex-syntax v0.8.10
2026-07-31T05:56:45.8418124Z    Compiling constant_time_eq v0.4.2
2026-07-31T05:56:45.8533957Z    Compiling sha1_smol v1.0.1
2026-07-31T05:56:45.8558705Z    Compiling schemars_derive v1.2.1
2026-07-31T05:56:46.8884660Z    Compiling iroh-dns v0.98.0
2026-07-31T05:56:47.2635550Z    Compiling serial-windows v0.4.0
2026-07-31T05:56:47.4317388Z    Compiling wmi v0.18.4
2026-07-31T05:56:47.5640132Z    Compiling igd-next v0.17.1
2026-07-31T05:56:47.8311418Z    Compiling lru v0.16.4
2026-07-31T05:56:47.8341306Z    Compiling webpki-roots v1.0.7
2026-07-31T05:56:47.8674200Z    Compiling seize v0.5.1
2026-07-31T05:56:48.0244768Z    Compiling darling_core v0.23.0
2026-07-31T05:56:48.4002232Z    Compiling toml_edit v0.22.27
2026-07-31T05:56:48.4215960Z    Compiling serde_bytes v0.11.19
2026-07-31T05:56:48.4224235Z    Compiling hmac v0.12.1
2026-07-31T05:56:48.7101833Z    Compiling regex-automata v0.4.14
2026-07-31T05:56:48.8351856Z    Compiling iroh v0.98.2
2026-07-31T05:56:48.8556890Z    Compiling anstyle v1.0.14
2026-07-31T05:56:48.9512588Z    Compiling bitflags v1.3.2
2026-07-31T05:56:49.1057227Z    Compiling dyn-clone v1.0.20
2026-07-31T05:56:49.3497495Z    Compiling pin-utils v0.1.0
2026-07-31T05:56:49.3834247Z    Compiling cmov v0.5.4
2026-07-31T05:56:49.3834559Z    Compiling once_cell_polyfill v1.70.2
2026-07-31T05:56:49.4167423Z    Compiling lazy_static v1.5.0
2026-07-31T05:56:49.5443952Z    Compiling anstyle-wincon v3.0.11
2026-07-31T05:56:49.6089162Z    Compiling shared_library v0.1.9
2026-07-31T05:56:49.6089520Z    Compiling ctutils v0.4.2
2026-07-31T05:56:49.6653210Z    Compiling nix v0.25.1
2026-07-31T05:56:49.7503567Z    Compiling schemars v1.2.1
2026-07-31T05:56:49.8295863Z    Compiling portmapper v0.16.0
2026-07-31T05:56:49.9720374Z    Compiling hkdf v0.12.4
2026-07-31T05:56:50.0018503Z    Compiling papaya v0.2.4
2026-07-31T05:56:50.0756902Z    Compiling filedescriptor v0.8.3
2026-07-31T05:56:50.4634906Z    Compiling serial v0.4.0
2026-07-31T05:56:50.4944591Z    Compiling swarm-discovery v0.6.0-alpha.2
2026-07-31T05:56:50.6644713Z    Compiling toml v0.8.23
2026-07-31T05:56:50.6814843Z    Compiling anstyle-parse v1.0.0
2026-07-31T05:56:50.6925880Z    Compiling backon v1.6.0
2026-07-31T05:56:50.7030594Z    Compiling anstyle-query v1.1.5
2026-07-31T05:56:51.5118171Z    Compiling regex v1.12.3
2026-07-31T05:56:51.7897565Z    Compiling vte_generate_state_changes v0.1.2
2026-07-31T05:56:51.8320137Z    Compiling shell-words v1.1.1
2026-07-31T05:56:52.2551779Z    Compiling paste v1.0.15
2026-07-31T05:56:52.2691881Z    Compiling foldhash v0.1.5
2026-07-31T05:56:52.3623214Z    Compiling unicode-width v0.2.0
2026-07-31T05:56:52.4171075Z    Compiling is_terminal_polyfill v1.70.2
2026-07-31T05:56:52.4171505Z    Compiling instability v0.3.12
2026-07-31T05:56:53.6967324Z    Compiling downcast-rs v1.2.1
2026-07-31T05:56:53.7243519Z    Compiling colorchoice v1.0.5
2026-07-31T05:56:53.7435299Z    Compiling hashbrown v0.15.5
2026-07-31T05:56:53.7831902Z    Compiling spt-runtime v0.47.0 (C:\actions-runner\_work\spt-bs-core\spt-bs-core\crates\spt-runtime)
2026-07-31T05:56:53.8734142Z    Compiling portable-pty v0.8.1
2026-07-31T05:56:53.9813191Z    Compiling vte v0.13.1
2026-07-31T05:56:54.0827224Z    Compiling anstream v1.0.0
2026-07-31T05:56:54.1669709Z    Compiling spake2 v0.4.0
2026-07-31T05:56:54.2070422Z    Compiling darling_macro v0.23.0
2026-07-31T05:56:54.8231104Z    Compiling strum_macros v0.26.4
2026-07-31T05:56:55.3834239Z    Compiling terminal_size v0.4.4
2026-07-31T05:56:55.4608820Z    Compiling crossterm_winapi v0.9.1
2026-07-31T05:56:55.8681887Z    Compiling itertools v0.13.0
2026-07-31T05:56:56.0618458Z    Compiling castaway v0.2.4
2026-07-31T05:56:56.1386693Z    Compiling sha1 v0.10.6
2026-07-31T05:56:56.2803677Z    Compiling unicode-width v0.1.14
2026-07-31T05:56:56.2849183Z    Compiling static_assertions v1.1.0
2026-07-31T05:56:56.4588793Z    Compiling clap_lex v1.1.0
2026-07-31T05:56:56.6983881Z    Compiling doctest-file v1.1.1
2026-07-31T05:56:56.8182042Z    Compiling indoc v2.0.7
2026-07-31T05:56:56.9142086Z    Compiling recvmsg v1.0.0
2026-07-31T05:56:57.0154037Z    Compiling spt-live v0.47.0 (C:\actions-runner\_work\spt-bs-core\spt-bs-core\crates\spt-live)
2026-07-31T05:56:57.3363329Z    Compiling darling v0.23.0
2026-07-31T05:56:57.5916726Z    Compiling crossterm v0.28.1
2026-07-31T05:56:58.0615595Z    Compiling spt-term v0.47.0 (C:\actions-runner\_work\spt-bs-core\spt-bs-core\crates\spt-term)
2026-07-31T05:56:58.4577565Z    Compiling lru v0.12.5
2026-07-31T05:56:58.6356445Z    Compiling clap_derive v4.6.1
2026-07-31T05:56:59.1073359Z    Compiling strum v0.26.3
2026-07-31T05:56:59.2915184Z    Compiling unicode-truncate v1.1.0
2026-07-31T05:56:59.7731182Z    Compiling compact_str v0.8.2
2026-07-31T05:57:00.0579680Z    Compiling clap_builder v4.6.0
2026-07-31T05:57:00.1760881Z    Compiling error-code v3.3.2
2026-07-31T05:57:00.1761246Z    Compiling cassowary v0.3.0
2026-07-31T05:57:00.1761519Z    Compiling nucleo-matcher v0.3.1
2026-07-31T05:57:00.1761762Z    Compiling qrcode v0.14.1
2026-07-31T05:57:00.6032558Z    Compiling clipboard-win v5.4.1
2026-07-31T05:57:00.9624686Z    Compiling interprocess v2.4.2
2026-07-31T05:57:02.1378084Z    Compiling ratatui v0.29.0
2026-07-31T05:57:02.5662614Z    Compiling clap v4.6.1
2026-07-31T05:57:22.0247675Z    Compiling rustls-webpki v0.103.13
2026-07-31T05:57:24.6957723Z    Compiling tokio-rustls v0.26.4
2026-07-31T05:57:24.6958029Z    Compiling rustls-platform-verifier v0.7.0
2026-07-31T05:57:24.6958315Z    Compiling noq-proto v0.17.0
2026-07-31T05:57:25.6450690Z    Compiling hyper-rustls v0.27.9
2026-07-31T05:57:25.6452016Z    Compiling hickory-net v0.26.0-beta.4
2026-07-31T05:57:25.6452284Z    Compiling tokio-websockets v0.13.2
2026-07-31T05:57:25.8615245Z    Compiling reqwest v0.13.4
2026-07-31T05:57:26.9681818Z    Compiling hickory-resolver v0.26.0-beta.4
2026-07-31T05:57:48.0139279Z    Compiling spt-net v0.47.0 (C:\actions-runner\_work\spt-bs-core\spt-bs-core\crates\spt-net)
2026-07-31T05:57:49.7711900Z    Compiling spt-daemon v0.47.0 (C:\actions-runner\_work\spt-bs-core\spt-bs-core\crates\spt-daemon)
2026-07-31T05:58:04.4933856Z    Compiling spt v0.47.0 (C:\actions-runner\_work\spt-bs-core\spt-bs-core\crates\spt)
2026-07-31T05:58:04.9715539Z     Finished `dev` profile [unoptimized + debuginfo] target(s) in 1m 57s
2026-07-31T05:58:05.1383886Z ##[group]Run cargo test --workspace --lib --bins
2026-07-31T05:58:05.1384234Z [36;1mcargo test --workspace --lib --bins[0m
2026-07-31T05:58:05.1392411Z shell: C:\Program Files\PowerShell\7\pwsh.EXE -command ". '{0}'"
2026-07-31T05:58:05.1392770Z ##[endgroup]
2026-07-31T05:58:06.6770814Z    Compiling fastrand v2.4.1
2026-07-31T05:58:06.7151066Z    Compiling bytemuck v1.25.2
2026-07-31T05:58:06.7166054Z    Compiling mock-adapter v0.47.0 (C:\actions-runner\_work\spt-bs-core\spt-bs-core\adapters\mock)
2026-07-31T05:58:06.7166487Z    Compiling spt-proto v0.47.0 (C:\actions-runner\_work\spt-bs-core\spt-bs-core\crates\spt-proto)
2026-07-31T05:58:06.7853430Z    Compiling futures-lite v2.6.1
2026-07-31T05:58:06.7853717Z    Compiling tempfile v3.27.0
2026-07-31T05:58:06.7857214Z    Compiling backon v1.6.0
2026-07-31T05:58:06.8376341Z    Compiling rgb v0.8.53
2026-07-31T05:58:07.1249016Z    Compiling spt-test-support v0.47.0 (C:\actions-runner\_work\spt-bs-core\spt-bs-core\crates\spt-test-support)
2026-07-31T05:58:07.3233577Z    Compiling spt-live v0.47.0 (C:\actions-runner\_work\spt-bs-core\spt-bs-core\crates\spt-live)
2026-07-31T05:58:07.3234299Z    Compiling spt-runtime v0.47.0 (C:\actions-runner\_work\spt-bs-core\spt-bs-core\crates\spt-runtime)
2026-07-31T05:58:07.3234973Z    Compiling spt-store v0.47.0 (C:\actions-runner\_work\spt-bs-core\spt-bs-core\crates\spt-store)
2026-07-31T05:58:07.4102802Z    Compiling avt v0.18.0
2026-07-31T05:58:07.4145307Z    Compiling spt-msg v0.47.0 (C:\actions-runner\_work\spt-bs-core\spt-bs-core\crates\spt-msg)
2026-07-31T05:58:07.5969185Z    Compiling n0-future v0.3.2
2026-07-31T05:58:07.7405357Z    Compiling n0-watcher v0.6.1
2026-07-31T05:58:07.7405799Z    Compiling iroh-dns v0.98.0
2026-07-31T05:58:08.1466623Z    Compiling netwatch v0.16.0
2026-07-31T05:58:08.2077425Z    Compiling iroh-relay v0.98.0
2026-07-31T05:58:08.3005651Z    Compiling spt-term v0.47.0 (C:\actions-runner\_work\spt-bs-core\spt-bs-core\crates\spt-term)
2026-07-31T05:58:08.8805028Z    Compiling portmapper v0.16.0
2026-07-31T05:58:14.5723764Z    Compiling iroh v0.98.2
2026-07-31T05:58:26.1366886Z    Compiling spt-net v0.47.0 (C:\actions-runner\_work\spt-bs-core\spt-bs-core\crates\spt-net)
2026-07-31T05:58:28.2988440Z    Compiling spt-daemon v0.47.0 (C:\actions-runner\_work\spt-bs-core\spt-bs-core\crates\spt-daemon)
2026-07-31T05:58:46.4918620Z    Compiling xtask v0.47.0 (C:\actions-runner\_work\spt-bs-core\spt-bs-core\crates\xtask)
2026-07-31T05:58:46.4919727Z    Compiling spt v0.47.0 (C:\actions-runner\_work\spt-bs-core\spt-bs-core\crates\spt)
2026-07-31T05:59:02.0738006Z     Finished `test` profile [unoptimized + debuginfo] target(s) in 56.63s
2026-07-31T05:59:02.1083969Z      Running unittests src\capture_player.rs (target\debug\deps\capture_player-84a75d77b2d165f9.exe)
2026-07-31T05:59:02.7464436Z 
2026-07-31T05:59:02.7464812Z running 2 tests
2026-07-31T05:59:02.7471205Z test tests::refuses_a_length_mismatch ... ok
2026-07-31T05:59:02.7471656Z test tests::parses_a_well_formed_record ... ok
2026-07-31T05:59:02.7471911Z 
2026-07-31T05:59:02.7472158Z test result: ok. 2 passed; 0 failed; 0 ignored; 0 measured; 0 filtered out; finished in 0.00s
2026-07-31T05:59:02.7472532Z 
2026-07-31T05:59:02.7580830Z      Running unittests src\console_mode_probe.rs (target\debug\deps\console_mode_probe-d91fa02ff96577ea.exe)
2026-07-31T05:59:03.0573992Z 
2026-07-31T05:59:03.0574319Z running 0 tests
2026-07-31T05:59:03.0574516Z 
2026-07-31T05:59:03.0574779Z test result: ok. 0 passed; 0 failed; 0 ignored; 0 measured; 0 filtered out; finished in 0.00s
2026-07-31T05:59:03.0575162Z 
2026-07-31T05:59:03.0590780Z      Running unittests src\main.rs (target\debug\deps\mock_session-913c6f569abb0eba.exe)
2026-07-31T05:59:03.2313710Z 
2026-07-31T05:59:03.2314088Z running 0 tests
2026-07-31T05:59:03.2314236Z 
2026-07-31T05:59:03.2314486Z test result: ok. 0 passed; 0 failed; 0 ignored; 0 measured; 0 filtered out; finished in 0.00s
2026-07-31T05:59:03.2314805Z 
2026-07-31T05:59:03.2341859Z      Running unittests src\shell.rs (target\debug\deps\mock_shell-4153450c5e0c04ba.exe)
2026-07-31T05:59:03.4700833Z 
2026-07-31T05:59:03.4701274Z running 0 tests
2026-07-31T05:59:03.4701461Z 
2026-07-31T05:59:03.4702121Z test result: ok. 0 passed; 0 failed; 0 ignored; 0 measured; 0 filtered out; finished in 0.00s
2026-07-31T05:59:03.4702622Z 
2026-07-31T05:59:03.4721293Z      Running unittests tests\fixtures\gh_fixture.rs (target\debug\deps\gh_fixture-ecc23862a3fbe40c.exe)
2026-07-31T05:59:03.5776765Z 
2026-07-31T05:59:03.5777070Z running 0 tests
2026-07-31T05:59:03.5777232Z 
2026-07-31T05:59:03.5777528Z test result: ok. 0 passed; 0 failed; 0 ignored; 0 measured; 0 filtered out; finished in 0.00s
2026-07-31T05:59:03.5777885Z 
2026-07-31T05:59:03.5826440Z      Running unittests tests\fixtures\git_fixture.rs (target\debug\deps\git_fixture-b85d451740889423.exe)
2026-07-31T05:59:03.6639130Z 
2026-07-31T05:59:03.6639357Z running 0 tests
2026-07-31T05:59:03.6639464Z 
2026-07-31T05:59:03.6639656Z test result: ok. 0 passed; 0 failed; 0 ignored; 0 measured; 0 filtered out; finished in 0.00s
2026-07-31T05:59:03.6639884Z 
2026-07-31T05:59:03.6651043Z      Running unittests tests\fixtures\post_step_fixture.rs (target\debug\deps\post_step_fixture-fbadfeb8eba9ff1b.exe)
2026-07-31T05:59:03.8525259Z 
2026-07-31T05:59:03.8525589Z running 0 tests
2026-07-31T05:59:03.8525745Z 
2026-07-31T05:59:03.8526014Z test result: ok. 0 passed; 0 failed; 0 ignored; 0 measured; 0 filtered out; finished in 0.00s
2026-07-31T05:59:03.8526364Z 
2026-07-31T05:59:03.8542387Z      Running unittests src\main.rs (target\debug\deps\spt-b39679f88e654a40.exe)
2026-07-31T05:59:05.0813933Z 
2026-07-31T05:59:05.0814295Z running 475 tests
2026-07-31T05:59:05.0818896Z test accessview::tests::drill_matches_only_its_own_kind ... ok
2026-07-31T05:59:05.0819714Z test accessview::tests::node_roster_lists_node_scope_entities_and_mode_exceptions ... ok
2026-07-31T05:59:05.0820308Z test accessview::tests::target_roster_groups_types_and_counts_rules ... ok
2026-07-31T05:59:05.0822796Z test api::auth::tests::mints_distinct_nonempty_tokens ... ok
2026-07-31T05:59:05.1052867Z test api::auth::tests::pinned_to_dead_sid_mismatched_poll_repins ... ok
2026-07-31T05:59:05.1198757Z test api::auth::tests::token_proof_authenticates ... ok
2026-07-31T05:59:05.1560759Z test api::auth::tests::dead_owner_repin_still_rescues_a_non_custody_sid ... ok
2026-07-31T05:59:05.1657096Z test api::auth::tests::missing_endpoint_is_no_endpoint ... ok
2026-07-31T05:59:05.1657675Z test api::auth::tests::live_owner_mismatch_still_refuses ... ok
2026-07-31T05:59:05.1665066Z test api::delivery::tests::inject_all_pty_falls_back_to_hook ... ok
2026-07-31T05:59:05.1667583Z test api::delivery::tests::inject_resolution_drops_pty_defaults_hook ... ok
2026-07-31T05:59:05.1796384Z test api::auth::tests::no_proof_is_refused ... ok
2026-07-31T05:59:05.1996791Z test api::auth::tests::dead_owner_repin_refused_when_sid_is_a_psyche_custody_sid ... ok
2026-07-31T05:59:05.2097325Z test api::auth::tests::token_auth_path_unchanged ... ok
2026-07-31T05:59:05.2305787Z test api::auth::tests::worker_missing_is_no_endpoint ... ok
2026-07-31T05:59:05.2316654Z test api::auth::tests::dead_owner_repin_refused_when_sid_owns_another_perch ... ok
2026-07-31T05:59:05.2523411Z test api::auth::tests::worker_parent_current_sid_authenticates_after_rotation ... ok
2026-07-31T05:59:05.2651544Z test api::auth::tests::session_id_proof_authenticates ... ok
2026-07-31T05:59:05.2652877Z test api::engineroom::tests::a_refresh_adopts_only_a_real_divergence ... ok
2026-07-31T05:59:05.2657997Z test api::engineroom::tests::an_admin_code_verifies_across_the_ceremony_window_only ... ok
2026-07-31T05:59:05.2659261Z test api::engineroom::tests::subnet_authority_is_the_empowerment_not_the_gate ... ok
2026-07-31T05:59:05.2660576Z test api::engineroom::tests::the_gate_admits_only_the_reserved_id_provisioned_and_authenticated ... ok
2026-07-31T05:59:05.2662386Z test api::engineroom::tests::the_written_node_mode_is_the_one_the_chain_reads ... ok
2026-07-31T05:59:05.2847835Z test api::auth::tests::worker_stored_sid_authenticates ... ok
2026-07-31T05:59:05.3003635Z test api::auth::tests::worker_wrong_sid_and_token_only_refused ... ok
2026-07-31T05:59:05.3135777Z test api::auth::tests::wrong_token_and_wrong_session_refused ... ok
2026-07-31T05:59:05.3420851Z test api::delivery::tests::an_undated_state_is_dated_by_a_non_edge_report ... ok
2026-07-31T05:59:05.3495612Z test api::delivery::tests::echo_gate_explicit_toggle ... ok
2026-07-31T05:59:05.3634976Z test api::delivery::tests::idle_busy_transitions_manage_sentinels ... ok
2026-07-31T05:59:05.4704389Z test api::delivery::tests::idle_drain_peek_returns_non_deferred_rows_only ... ok
2026-07-31T05:59:05.4707410Z test api::reporting::tests::capability_lists_hostable_types ... ok
2026-07-31T05:59:05.4790801Z test api::delivery::tests::idle_no_gate_does_not_arm_gate ... ok
2026-07-31T05:59:05.5597474Z test api::delivery::tests::only_a_real_state_edge_stamps_the_transition_instant ... ok
2026-07-31T05:59:05.7195446Z test api::delivery::tests::poll_drain_holds_deferred_while_resting_and_releases_once_on_wake ... ok
2026-07-31T05:59:05.7196620Z test api::reporting::tests::endpoint_info_attached_node_from_honest_stamps ... ok
2026-07-31T05:59:05.7197828Z test api::reporting::tests::endpoint_info_attached_node_self_attributes_own_node_driver ... ok
2026-07-31T05:59:05.7200260Z test api::reporting::tests::endpoint_info_json_always_carries_an_activity_word ... ok
2026-07-31T05:59:05.9030065Z test api::delivery::tests::poll_drain_suppresses_idle_only_which_reaches_the_relay ... ok
2026-07-31T05:59:05.9065972Z test api::reporting::tests::env_aliases_resolved_from_manifest ... ok
2026-07-31T05:59:06.1029341Z test api::delivery::tests::poll_drain_validates_notify_copies_against_their_rows ... ok
2026-07-31T05:59:06.1032198Z test api::reporting::tests::filedrops_are_fixed_named_files ... ok
2026-07-31T05:59:06.2800451Z test api::delivery::tests::poll_drains_non_deferred_by_default ... ok
2026-07-31T05:59:06.3943995Z test api::delivery::tests::poll_only_drains_when_hook_method_present ... ok
2026-07-31T05:59:07.9311330Z test api::engineroom::tests::a_non_engine_room_attempt_never_touches_the_empower_ledger ... ok
2026-07-31T05:59:08.1369788Z test api::reporting::tests::boundary_appends_to_the_session_ledger ... ok
2026-07-31T05:59:08.3451631Z test api::reporting::tests::boundary_missing_perch_refused ... ok
2026-07-31T05:59:08.3508620Z test api::reporting::tests::boundary_injects_deferred_shell_context ... ok
2026-07-31T05:59:08.4285449Z test api::reporting::tests::boundary_rebinds_keeping_anchor ... ok
2026-07-31T05:59:08.4489428Z test api::reporting::tests::boundary_refuses_rotating_onto_a_psyche_custody_sid ... ok
2026-07-31T05:59:08.6429427Z test api::reporting::tests::boundary_resurfaces_undismissed_notifs ... ok
2026-07-31T05:59:08.6549905Z test api::startup::tests::a_dead_binder_pid_proves_nothing_and_never_drops_the_stamp ... ok
2026-07-31T05:59:08.6550917Z test api::startup::tests::a_dead_relays_capability_stamp_is_not_resurrected_by_a_listener_rebind ... ok
2026-07-31T05:59:08.7351390Z test api::reporting::tests::boundary_with_a_fresh_sid_is_unaffected_by_the_squat_guard ... ok
2026-07-31T05:59:08.7963119Z test api::reporting::tests::digest_entry_validates_and_appends_to_digest_log ... ok
2026-07-31T05:59:08.8313446Z test api::reporting::tests::driven_by_reads_daemon_marker ... ok
2026-07-31T05:59:08.8707689Z test api::reporting::tests::endpoint_info_activity_word_tracks_the_idle_sentinel ... ok
2026-07-31T05:59:08.8926862Z test api::reporting::tests::endpoint_info_reports_and_refuses ... ok
2026-07-31T05:59:08.9717131Z test api::reporting::tests::erase_unregisters_regardless_of_liveness ... ok
2026-07-31T05:59:08.9806467Z test api::reporting::tests::hint_once_per_session_one_per_message ... ok
2026-07-31T05:59:08.9950833Z test api::reporting::tests::history_log_appends ... ok
2026-07-31T05:59:09.0005804Z test api::reporting::tests::presence_records_endpoint ... ok
2026-07-31T05:59:09.1215618Z test api::reporting::tests::session_end_erase_reaps_stale_worker_then_proceeds ... ok
2026-07-31T05:59:09.2197368Z test api::reporting::tests::session_end_erase_refused_with_live_children ... ok
2026-07-31T05:59:09.2551457Z test api::reporting::tests::session_end_erase_wipes_childless_perch ... ok
2026-07-31T05:59:09.2553034Z test api::startup::tests::fresh_bind_over_dead_life_needs_both_terminal_and_a_new_session ... ok
2026-07-31T05:59:09.2991976Z test api::reporting::tests::session_end_soft_preserves_state ... ok
2026-07-31T05:59:09.3445329Z test api::reporting::tests::soft_end_preserves_a_live_listeners_address ... ok
2026-07-31T05:59:09.3446620Z test api::startup::tests::listen_never_asserts_hosting_topology_and_bind_still_does ... ok
2026-07-31T05:59:09.3447762Z test api::startup::tests::listen_online_gate_refuses_capability_only_online ... ok
2026-07-31T05:59:09.3449152Z test api::startup::tests::listen_orphan_exit_line_names_self_and_parent ... ok
2026-07-31T05:59:09.4074857Z test api::reporting::tests::soft_end_still_cleans_a_dead_listeners_address ... ok
2026-07-31T05:59:10.0192636Z test api::startup::tests::a_listener_over_a_dead_pty_is_not_offlined_by_the_liveness_reconcile ... ok
2026-07-31T05:59:10.0934774Z test api::startup::tests::bind_assigns_home_and_revive_preserves_it ... ok
2026-07-31T05:59:10.1619529Z test api::startup::tests::bind_gateway_earns_no_online_stamp ... ok
2026-07-31T05:59:10.1683127Z test api::startup::tests::parent_watchdog_triggers_exit_on_a_dead_parent_only ... ok
2026-07-31T05:59:10.6837612Z test api::startup::tests::bind_listen_control_detach_keeps_the_earned_hosting_authority ... ok
2026-07-31T05:59:10.6839552Z test api::startup::tests::read_env_measured_capture_replaces_prior_stamp ... ok
2026-07-31T05:59:10.7741789Z test api::startup::tests::bind_live_agent_over_prior_ready_agent_earns_online_on_controllable_with_preserved_type ... ok
2026-07-31T05:59:11.0731859Z test api::startup::tests::bind_records_cwd_so_picker_can_group_by_project ... ok
2026-07-31T05:59:11.0843296Z test api::startup::tests::bind_refuses_a_session_id_that_squats_a_psyche_custody_sid ... ok
2026-07-31T05:59:11.1834675Z test api::startup::tests::bind_with_type_establishes_a_gateway_endpoint ... ok
2026-07-31T05:59:11.1836063Z test api::startup::tests::seed_fail_eof_gives_actionable_stale_broker_hint ... ok
2026-07-31T05:59:11.1837334Z test api::startup::tests::seed_restorable_spends_dead_seeds_restores_recoverable ... ok
2026-07-31T05:59:11.2027328Z test api::startup::tests::bind_with_unrelated_sid_is_unaffected_by_the_squat_guard ... ok
2026-07-31T05:59:11.2070774Z test api::startup::tests::empty_session_seed_refusal_spends_the_seed_no_restore ... ok
2026-07-31T05:59:11.2133706Z test api::startup::tests::empty_session_seed_refused ... ok
2026-07-31T05:59:11.3363738Z test api::startup::tests::establish_stamps_controllable_by_hosting_mode ... ok
2026-07-31T05:59:11.4527703Z test api::startup::tests::fresh_create_over_a_stopped_life_reads_active_with_no_wake ... ok
2026-07-31T05:59:11.5315360Z test api::startup::tests::fresh_create_with_no_prior_carries_no_rest_state ... ok
2026-07-31T05:59:11.5316059Z test api::startup::tests::the_pid_role_is_stamped_from_the_entry_path ... ok
2026-07-31T05:59:11.5527492Z test api::startup::tests::live_perch_under_other_session_conflicts ... ok
2026-07-31T05:59:11.5544252Z test api::tests::adapter_is_optional ... ok
2026-07-31T05:59:11.5577703Z test api::startup::tests::missing_seed_refused ... ok
2026-07-31T05:59:11.5850166Z test api::startup::tests::no_seed_is_the_fallback_trigger_then_sid_binds ... ok
2026-07-31T05:59:11.6542829Z test api::startup::tests::post_spawn_bind_establishes_perch ... ok
2026-07-31T05:59:11.6786722Z test api::startup::tests::prebind_refusal_restores_the_seed_for_retry ... ok
2026-07-31T05:59:11.6796354Z test api::tests::state_value_is_validated ... ok
2026-07-31T05:59:11.6859479Z test api::tests::surface_parses ... ok
2026-07-31T05:59:11.7772808Z test api::startup::tests::rebind_same_session_ok ... ok
2026-07-31T05:59:11.8754561Z test api::startup::tests::revive_preserves_prior_rest_state_and_dormant_anchor ... ok
2026-07-31T05:59:11.9609493Z test api::startup::tests::revive_without_cwd_preserves_prior_cwd ... ok
2026-07-31T05:59:11.9806348Z test api::startup::tests::seed_bind_records_seed_captured_cwd ... ok
2026-07-31T05:59:11.9918604Z test api::startup::tests::session_id_fallback_binds_live_perch_from_sid ... ok
2026-07-31T05:59:12.0035051Z test api::startup::tests::session_id_fallback_refuses_empty_sid_and_dead_anchor ... ok
2026-07-31T05:59:12.0040343Z test api::startup::tests::session_id_fallback_refuses_a_psyche_custody_sid ... ok
2026-07-31T05:59:12.0048045Z test cli::resume_resolution_tests::resume_never_feeds_a_provisional ... ok
2026-07-31T05:59:12.0049499Z test cli::run_home_tests::order_by_mru_orders_guidance ... ok
2026-07-31T05:59:12.0050778Z test cli::run_home_tests::run_home_resolution_matrix ... ok
2026-07-31T05:59:12.0052791Z test cli::run_on_live_tests::run_on_live_never_duplicates_and_create_conflicts ... ok
2026-07-31T05:59:12.0054046Z test cli::run_target_tests::resolve_run_target_quadrants ... ok
2026-07-31T05:59:12.0100886Z test api::startup::tests::stale_seed_refusal_spends_the_seed_no_restore ... ok
2026-07-31T05:59:12.0103268Z test cli::tests::a_status_row_reads_held_over_running_and_carries_its_evidence ... ok
2026-07-31T05:59:12.0163707Z test api::startup::tests::stale_seed_with_dead_anchor_refused ... ok
2026-07-31T05:59:12.0190761Z test cli::tests::access_subcommands_parse ... ok
2026-07-31T05:59:12.0209240Z test cli::tests::adapter_add_transport_flags_parse ... ok
2026-07-31T05:59:12.0402726Z test api::startup::tests::successful_bind_consumes_the_seed_exactly_once ... ok
2026-07-31T05:59:12.0517333Z test cli::tests::a_local_hit_never_asks_the_broker ... ok
2026-07-31T05:59:12.0620220Z test api::startup::tests::valid_seed_binds_live_perch ... ok
2026-07-31T05:59:12.0622274Z test cli::tests::adapter_name_validation_flags_every_unknown ... ok
2026-07-31T05:59:12.0623758Z test cli::tests::adapter_names_comma_list_parses_and_refuses_empties ... ok
2026-07-31T05:59:12.0683010Z test api::tests::ctx_manifest_override_wins_when_manifest_present ... ok
2026-07-31T05:59:12.0778763Z test api::tests::ctx_manifest_unregistered_no_manifest_is_none_not_fatal ... ok
2026-07-31T05:59:12.0786282Z test api::tests::ctx_manifest_resolves_from_registry_when_manifest_absent ... ok
2026-07-31T05:59:12.0812237Z test api::tests::load_manifest_resolves_composite_adapter_option ... ok
2026-07-31T05:59:12.0851690Z test cli::tests::adapter_translate_proof_parses ... ok
2026-07-31T05:59:12.0853282Z test cli::tests::adapter_update_install_dir_is_registered_source_dir_not_repo_name ... ok
2026-07-31T05:59:12.0858313Z test cli::tests::adapter_update_notice_absent_when_no_message ... ok
2026-07-31T05:59:12.0863005Z test cli::tests::adapter_update_notice_renders_declared_message_markdown ... ok
2026-07-31T05:59:12.0864992Z test cli::tests::adapter_update_summary_and_exit_aggregate_isolated_failures ... ok
2026-07-31T05:59:12.0891591Z test cli::tests::adapter_subcommands_parse ... ok
2026-07-31T05:59:12.0909102Z test cli::tests::adapter_version_parses ... ok
2026-07-31T05:59:12.8166621Z test api::worker::tests::cascade_guard_tracks_live_children ... ok
2026-07-31T05:59:12.8177107Z test cli::tests::all_hidden_this_node_suppresses_no_perches_marker ... ok
2026-07-31T05:59:12.8195038Z test cli::tests::already_applied_message_reads_up_to_date_no_restart ... ok
2026-07-31T05:59:14.4536246Z test api::worker::tests::guard_clears_only_when_all_children_stopped ... ok
2026-07-31T05:59:14.4537261Z test cli::tests::any_single_evidence_source_is_enough_and_only_nothing_refuses ... ok
2026-07-31T05:59:14.4565272Z test cli::tests::api_adapter_flag_is_group_level_not_post_subcommand ... ok
2026-07-31T05:59:14.4586822Z test cli::tests::api_listen_accepts_session_id_flag ... ok
2026-07-31T05:59:14.4589182Z test cli::tests::applied_message_appends_restart_required_notice ... ok
2026-07-31T05:59:14.4589976Z test cli::tests::applied_message_renders_semver_or_counter_fallback_and_states_applied ... ok
2026-07-31T05:59:14.6298128Z test api::worker::tests::worker_poll_drains_spool ... ok
2026-07-31T05:59:14.9106524Z test api::worker::tests::worker_poll_holds_deferred_while_resting ... ok
2026-07-31T05:59:14.9112639Z test api::worker::tests::worker_start_mints_id_stores_parent_sid_and_metadata ... ok
2026-07-31T05:59:14.9120512Z test api::worker::tests::worker_start_nests_under_parent ... ok
2026-07-31T05:59:14.9120946Z test cli::tests::bare_tty_guard ... ok
2026-07-31T05:59:14.9249714Z test cli::tests::bare_spt_parses_to_none ... ok
2026-07-31T05:59:14.9252816Z test cli::tests::bare_update_parses_composite_flags ... ok
2026-07-31T05:59:14.9258157Z test api::worker::tests::worker_start_registration_sid_falls_back_to_presented ... ok
2026-07-31T05:59:14.9258820Z test cli::tests::broker_image_line_reports_without_warning_or_remedy ... ok
2026-07-31T05:59:14.9261097Z test cli::tests::classify_fetch_reject_matrix ... ok
2026-07-31T05:59:14.9268188Z test cli::tests::classify_flat_archive_never_misfires ... ok
2026-07-31T05:59:14.9268604Z test cli::tests::cli_send_stamps_cli_at_node_origin ... ok
2026-07-31T05:59:14.9269062Z test cli::tests::composite_plans_core_first_and_core_only_skips_adapters ... ok
2026-07-31T05:59:14.9273264Z test cli::tests::connection_lines_net_less_hides_stale_heartbeat ... ok
2026-07-31T05:59:14.9278250Z test cli::tests::coordinator_image_line_is_the_only_stale_warning ... ok
2026-07-31T05:59:14.9284104Z test cli::tests::create_existing_name_is_usage_error ... ok
2026-07-31T05:59:14.9284808Z test cli::tests::create_mode_is_never_preselected ... ok
2026-07-31T05:59:14.9285261Z test cli::tests::classify_multiplatform_captures_only_known_triples ... ok
2026-07-31T05:59:14.9285820Z test cli::tests::create_mints_two_distinct_keys_and_records_the_mode ... ok
2026-07-31T05:59:14.9345217Z test cli::tests::create_not_elevated_refuses_without_saving ... ok
2026-07-31T05:59:14.9362332Z test cli::tests::create_new_existing_name_is_usage_error ... ok
2026-07-31T05:59:14.9444811Z test cli::tests::cross_node_after_filters_a_sealed_turn_exactly_like_the_local_path ... ok
2026-07-31T05:59:14.9476455Z test cli::tests::daemon_offline_hint_only_when_down ... ok
2026-07-31T05:59:14.9498009Z test cli::tests::daemon_refresh_verb_parses ... ok
2026-07-31T05:59:14.9498386Z test cli::tests::create_new_mints_shows_and_requests_save ... ok
2026-07-31T05:59:14.9504615Z test cli::tests::create_prints_joining_material_when_elevated ... ok
2026-07-31T05:59:14.9512219Z test cli::tests::daemonless_apply_message_points_at_finish_or_start ... ok
2026-07-31T05:59:14.9512899Z test cli::tests::deferred_elevation_gate_matrix ... ok
2026-07-31T05:59:14.9536443Z test cli::tests::digest_flag_defaults ... ok
2026-07-31T05:59:14.9537107Z test cli::tests::digest_cursor_flags_parse ... ok
2026-07-31T05:59:14.9538786Z test cli::tests::digest_human_path_keeps_the_stderr_trailer ... ok
2026-07-31T05:59:14.9540277Z test cli::tests::digest_json_carries_version_and_leaves_stderr_clean ... ok
2026-07-31T05:59:14.9541680Z test cli::tests::digest_json_predates_path_still_carries_version ... ok
2026-07-31T05:59:14.9542157Z test cli::tests::empty_store_no_flag_guides_to_pair_or_create ... ok
2026-07-31T05:59:14.9585289Z test cli::tests::endpoint_role_parses ... ok
2026-07-31T05:59:14.9587206Z test cli::tests::endpoint_row_json_endpoint_type_is_additive ... ok
2026-07-31T05:59:14.9605582Z test cli::tests::daemon_subcommands_parse ... ok
2026-07-31T05:59:14.9782225Z test cli::tests::endpoint_subcommands_parse ... ok
2026-07-31T05:59:14.9783258Z test cli::tests::engine_room_ceremony_decision_table ... ok
2026-07-31T05:59:14.9784933Z test cli::tests::engine_room_purge_resets_under_elevation_and_refuses_without_it ... ok
2026-07-31T05:59:14.9786376Z test cli::tests::escalation_choice_parses_fail_closed ... ok
2026-07-31T05:59:14.9882014Z test cli::tests::create_provisions_the_admin_key_and_show_code_never_does ... ok
2026-07-31T05:59:14.9917865Z test cli::tests::every_read_status_command_emits_valid_json ... ok
2026-07-31T05:59:15.8424144Z test cli::tests::extract_legacy_flat_stays_flat ... ok
2026-07-31T05:59:15.9720244Z test cli::tests::extract_multiplatform_missing_my_triple_is_typed_rejection ... ok
2026-07-31T05:59:15.9721119Z test cli::tests::fetch_reject_action_apply_decision ... ok
2026-07-31T05:59:15.9722943Z test cli::tests::filter_after_excludes_at_or_below_cursor ... ok
2026-07-31T05:59:15.9725554Z test cli::tests::filter_after_predates_window_returns_full ... ok
2026-07-31T05:59:15.9727355Z test cli::tests::finish_message_states_fully_live_no_manual_restart ... ok
2026-07-31T05:59:16.1375051Z test cli::tests::apply_release_crc_swap_only_swaps_changed ... ok
2026-07-31T05:59:16.1376351Z test cli::tests::gh_download_command_no_tag_omits_tag ... ok
2026-07-31T05:59:16.1377782Z test cli::tests::gh_download_command_with_tag_shape ... ok
2026-07-31T05:59:16.1379140Z test cli::tests::gh_failure_classes_render_os_correct_hints ... ok
2026-07-31T05:59:16.1380801Z test cli::tests::gh_release_version_compare_decision ... ok
2026-07-31T05:59:16.1381972Z test cli::tests::gh_version_command_shape ... ok
2026-07-31T05:59:16.1429892Z test cli::tests::grant_subcommands_parse ... ok
2026-07-31T05:59:16.1470925Z test cli::tests::help_groups_cover_every_command ... ok
2026-07-31T05:59:16.1576717Z test cli::tests::hot_path_flat_and_moved_verbs_gone ... ok
2026-07-31T05:59:16.1612678Z test cli::tests::how_to_topics_cover_ready_and_send ... ok
2026-07-31T05:59:16.1710902Z test cli::tests::install_place_is_idempotent_and_path_block_detected ... ok
2026-07-31T05:59:16.1712078Z test cli::tests::install_platform_check_gates_stamp_and_host_arch ... ok
2026-07-31T05:59:16.1714202Z test cli::tests::instance_rows_palette_and_align ... ok
2026-07-31T05:59:16.1716842Z test cli::tests::instance_rows_project_column ... ok
2026-07-31T05:59:16.1736142Z test cli::tests::invalid_usage_errors ... ok
2026-07-31T05:59:16.1737618Z test cli::tests::join_gate_refuses_without_confirmed_elevation ... ok
2026-07-31T05:59:16.1739658Z test cli::tests::json_activity_key_is_local_only_and_skips_when_unknown ... ok
2026-07-31T05:59:16.1748838Z test cli::tests::json_activity_words_come_from_the_shared_vocabulary_source ... ok
2026-07-31T05:59:16.3123004Z test cli::tests::adapter_digest_proof_fills_session_id_key ... ok
2026-07-31T05:59:16.3125089Z test cli::tests::json_project_field_skip_if_none ... ok
2026-07-31T05:59:16.3262135Z test cli::tests::multi_subnet_refuses_without_flag_then_resolves_with_it ... ok
2026-07-31T05:59:16.3264375Z test cli::tests::node_group_discards_self_and_skips_empty ... ok
2026-07-31T05:59:16.3266360Z test cli::tests::node_group_freshest_epoch_wins_and_unions_subnets ... ok
2026-07-31T05:59:16.3268611Z test cli::tests::node_group_same_id_two_nodes_two_groups ... ok
2026-07-31T05:59:16.3271506Z test cli::tests::node_grouped_render_structure_and_palette ... ok
2026-07-31T05:59:16.3274799Z test cli::tests::node_level_label_names_an_endpointless_peer ... ok
2026-07-31T05:59:16.3277226Z test cli::tests::node_rows_disambiguate_only_on_label_collision ... ok
2026-07-31T05:59:16.3279475Z test cli::tests::node_status_rows_denominator_counts_routable_only ... ok
2026-07-31T05:59:16.3282076Z test cli::tests::node_status_rows_settle_cheap_signals_probe_only_stale ... ok
2026-07-31T05:59:16.3287855Z test cli::tests::not_elevated_refuses_without_leaking_code_or_saving ... ok
2026-07-31T05:59:16.3296370Z test cli::tests::notify_subnet_resolution_home_default ... ok
2026-07-31T05:59:16.3358360Z test cli::tests::notify_surface_parses ... ok
2026-07-31T05:59:16.3359795Z test cli::tests::origin_asset_urls_latest_and_tag ... ok
2026-07-31T05:59:16.6896678Z test cli::tests::extract_multiplatform_places_shared_root_and_flattens_my_triple ... ok
2026-07-31T05:59:16.6917270Z test cli::tests::pair_namespace_is_gone ... ok
2026-07-31T05:59:16.6919882Z test cli::tests::peer_health_line_names_the_stage_and_stays_silent_when_idle ... ok
2026-07-31T05:59:16.6920794Z test cli::tests::poll_until_ready_fastpath_timeout_and_later_success ... ok
2026-07-31T05:59:16.6922115Z test cli::tests::post_step_notice_arbitration ... ok
2026-07-31T05:59:16.6948915Z test cli::tests::probe_all_cap_batches_into_windows ... ok
2026-07-31T05:59:16.8962789Z test cli::tests::probe_all_runs_concurrently_in_input_order ... ok
2026-07-31T05:59:17.0511163Z test cli::tests::probe_all_timeout_settles_false_without_stalling_batch ... ok
2026-07-31T05:59:17.0512727Z test cli::tests::project_index_line_states_health_not_presence ... ok
2026-07-31T05:59:17.0514316Z test cli::tests::prune_candidates_resolve_never_guess ... ok
2026-07-31T05:59:17.3207378Z test cli::tests::adapter_digest_proof_gates_on_drops ... ok
2026-07-31T05:59:17.3432611Z test cli::tests::adapter_has_live_endpoint_detects_matching_live_perch ... ok
2026-07-31T05:59:17.3935052Z test cli::tests::adapter_has_live_endpoint_false_for_other_or_dead ... ok
2026-07-31T05:59:17.4107935Z test cli::tests::registered_github_home_detects_active_collision ... ok
2026-07-31T05:59:17.4182414Z test cli::tests::adapter_profile_verbs_local_only ... ok
2026-07-31T05:59:17.4184082Z test cli::tests::remote_cell_project_ref_from_gossiped_recent_projects ... ok
2026-07-31T05:59:17.4409559Z test cli::tests::adapter_string_verbs ... ok
2026-07-31T05:59:17.4410861Z test cli::tests::resolve_transport_auto_follows_probe ... ok
2026-07-31T05:59:17.4411954Z test cli::tests::resolve_transport_explicit_never_probes ... ok
2026-07-31T05:59:17.4413634Z test cli::tests::rest_filter_hides_suspended_shows_all_and_corrupt_always ... ok
2026-07-31T05:59:17.4415185Z test cli::tests::rest_filter_status_first_ordering ... ok
2026-07-31T05:59:17.4416783Z test cli::tests::rest_filter_total_disclosure_and_corrupt_annotation ... ok
2026-07-31T05:59:17.4418024Z test cli::tests::restart_plans_lethal_leg_last ... ok
2026-07-31T05:59:17.4432020Z test cli::tests::ring_timeout_defaults ... ok
2026-07-31T05:59:17.5273948Z test cli::tests::run_bounded_yields_value_or_timeout_default ... ok
2026-07-31T05:59:17.5310365Z test cli::tests::self_pin_annotates_psyche_host_failure ... ok
2026-07-31T05:59:17.5315888Z test cli::tests::self_pin_annotates_translation_fault ... ok
2026-07-31T05:59:17.5318333Z test cli::tests::self_pin_includes_description_when_present ... ok
2026-07-31T05:59:17.5368984Z test cli::tests::send_reply_to_flag_is_removed_and_target_required ... ok
2026-07-31T05:59:17.5402752Z test cli::tests::send_user_msg_flag_parses ... ok
2026-07-31T05:59:17.6153969Z test cli::tests::release_archive_extracts_to_a_registrable_root ... ok
2026-07-31T05:59:22.8341865Z test cli::tests::adapter_translate_proof_gates_on_commit ... ok
2026-07-31T05:59:22.8589442Z test cli::tests::adapter_use_sets_and_clears_pointer ... ok
2026-07-31T05:59:22.8947934Z test cli::tests::adapter_version_surfaces_declared_adapter_version ... ok
2026-07-31T05:59:23.9728193Z test cli::tests::an_engine_room_reset_wipes_records_but_never_deletes_the_engine_room ... ok
2026-07-31T05:59:23.9906110Z test cli::tests::apply_user_msg_gate_local_origination ... ok
2026-07-31T05:59:27.8236665Z test cli::tests::endpoint_role_overwrite_is_the_sole_writer ... ok
2026-07-31T05:59:27.8379468Z test cli::tests::shell_subcommands_parse ... ok
2026-07-31T05:59:27.8519770Z test cli::tests::show_code_prints_reprovisioning_material ... ok
2026-07-31T05:59:27.9298224Z test cli::tests::endpoint_stop_marks_offline ... ok
2026-07-31T05:59:33.5589847Z test cli::tests::json_payload_rides_as_attr_alongside_body ... ok
2026-07-31T05:59:33.5935891Z test cli::tests::fork_forks_homes_and_deletes_exactly_the_source ... ok
2026-07-31T05:59:33.6106399Z test cli::tests::single_subnet_auto_selects_and_code_matches_seed ... ok
2026-07-31T05:59:51.9962707Z test cli::tests::owner_shutdown_gated_by_can_shutdown_grant ... ok
2026-07-31T05:59:52.6456171Z test cli::tests::stage_then_swap_failed_fetch_preserves_install ... ok
2026-07-31T05:59:53.7828588Z test cli::tests::staged_floor_admits_when_core_meets_floor ... ok
2026-07-31T05:59:54.9790527Z test cli::tests::staged_floor_refuses_above_floor_and_leaves_dest_untouched ... ok
2026-07-31T05:59:54.9791213Z test cli::tests::stall_evict_line_surfaces_only_a_real_tally ... ok
2026-07-31T05:59:54.9793833Z test cli::tests::stop_guard_refuses_live_sessions_without_force ... ok
2026-07-31T05:59:55.0077492Z test cli::tests::subcommands_parse ... ok
2026-07-31T05:59:55.0315677Z test cli::tests::subnet_arg_shapes_parse ... ok
2026-07-31T05:59:55.0316932Z test cli::tests::subnet_mode_lines_state_declared_captured_and_pending ... ok
2026-07-31T05:59:55.0323000Z test cli::tests::subnet_status_renders_rows_and_hints_never_secrets ... ok
2026-07-31T05:59:55.0324335Z test cli::tests::subnets_joined_banner_renders_rows_and_divider ... ok
2026-07-31T05:59:55.0325884Z test cli::tests::subprocess_detail_prefers_stderr_then_stdout ... ok
2026-07-31T05:59:55.0879869Z test cli::tests::the_evidence_census_reads_each_local_source ... ok
2026-07-31T05:59:55.0881784Z test cli::tests::this_node_group_merges_roster_with_unbound_truth ... ok
2026-07-31T05:59:55.0883227Z test cli::tests::trust_mutation_gate_refuses_without_confirmed_elevation ... ok
2026-07-31T05:59:55.0887690Z test cli::tests::unknown_elevation_falls_back ... ok
2026-07-31T05:59:55.0891333Z test cli::tests::unknown_named_subnet_is_usage_error ... ok
2026-07-31T05:59:55.0911333Z test cli::tests::update_adapters_verb_parses_with_optional_names ... ok
2026-07-31T05:59:55.0930288Z test cli::tests::update_fetch_apply_flag_parses ... ok
2026-07-31T05:59:55.0947125Z test cli::tests::whoami_parses_as_the_identity_verb ... ok
2026-07-31T05:59:55.0948623Z test elevation::tests::already_elevated_short_circuits_on_every_os ... ok
2026-07-31T05:59:55.0950054Z test elevation::tests::current_returns_a_determinate_level_on_supported_platforms ... ok
2026-07-31T05:59:55.0951386Z test elevation::tests::fallback_message_names_authenticator_app_and_subnet ... ok
2026-07-31T05:59:55.0952544Z test elevation::tests::gate_shows_only_when_confirmed_elevated ... ok
2026-07-31T05:59:55.0953923Z test elevation::tests::launcher_argv_is_absolute_exe_plus_verbatim_args ... ok
2026-07-31T05:59:55.0955575Z test elevation::tests::launchers_never_shell_interpolate_a_crafted_arg ... ok
2026-07-31T05:59:55.0957034Z test elevation::tests::print_hint_floor_uses_absolute_path_each_os ... ok
2026-07-31T05:59:55.0958212Z test elevation::tests::unix_path_order_tty_then_pkexec_then_terminal_then_hint ... ok
2026-07-31T05:59:55.0959359Z test elevation::tests::windows_uac_only_interactive_other_always_prints ... ok
2026-07-31T05:59:55.0960787Z test helpfmt::tests::atx_header_at_line_start_strips_and_bolds ... ok
2026-07-31T05:59:55.0962102Z test helpfmt::tests::bold_styles_with_color_and_strips_without ... ok
2026-07-31T05:59:55.0963407Z test helpfmt::tests::code_styles_with_color_and_strips_without ... ok
2026-07-31T05:59:55.0964604Z test helpfmt::tests::color_enabled_truth_table ... ok
2026-07-31T05:59:55.0965869Z test helpfmt::tests::dual_contract_token_survives_strip_mode ... ok
2026-07-31T05:59:55.0967165Z test helpfmt::tests::dual_contract_token_unstyled_while_prose_styles_on_color ... ok
2026-07-31T05:59:55.0968458Z test helpfmt::tests::empty_and_unmatched_markers_stay_literal ... ok
2026-07-31T05:59:55.0969629Z test helpfmt::tests::link_becomes_its_text ... ok
2026-07-31T05:59:55.0970836Z test helpfmt::tests::marker_never_spans_a_hard_break ... ok
2026-07-31T05:59:55.0972092Z test helpfmt::tests::marker_spans_a_clap_soft_wrap ... ok
2026-07-31T05:59:55.0973425Z test helpfmt::tests::multibyte_text_survives ... ok
2026-07-31T05:59:55.0974795Z test helpfmt::tests::nested_code_inside_bold_styles_both ... ok
2026-07-31T05:59:55.0976164Z test helpfmt::tests::plain_text_is_unchanged ... ok
2026-07-31T05:59:55.0977438Z test helpfmt::tests::preexisting_ansi_is_passed_through_untouched ... ok
2026-07-31T05:59:55.0979528Z test helpfmt::tests::resolve_console_color_strips_when_vt_unavailable ... ok
2026-07-31T05:59:55.0980906Z test picker::data::tests::disambiguate_project_ids_cases ... ok
2026-07-31T05:59:55.0982498Z test picker::data::tests::driven_by_display_renders_name_not_hex ... ok
2026-07-31T05:59:55.3793544Z test cli::tests::purge_force_asks_before_it_tears_anything_down ... ok
2026-07-31T05:59:55.3916889Z test cli::tests::purge_offline_gate_and_self_guard ... ok
2026-07-31T06:00:05.2868713Z test cli::tests::resolve_proof_target_override_reads_on_disk ... ok
2026-07-31T06:00:05.2870387Z test picker::data::tests::indexed_projection_full_w2shaped_and_absent_legs ... ok
2026-07-31T06:00:05.2872026Z test picker::data::tests::non_drivable_predicate_covers_worker_and_psyche ... ok
2026-07-31T06:00:05.2916324Z test cli::tests::purge_removes_every_record ... ok
2026-07-31T06:00:05.5948341Z test cli::tests::shell_channels_relay_sensory_and_text_file ... ok
2026-07-31T06:00:05.5950405Z test picker::data::tests::project_refs_from_sessions_excludes_owlery_and_dedups_newest_first ... ok
2026-07-31T06:00:05.5952454Z test picker::data::tests::project_refs_from_unions_fresh_origin_and_store_branches ... ok
2026-07-31T06:00:05.5954091Z test picker::data::tests::reconcile_overrides_subnet_with_local_roster ... ok
2026-07-31T06:00:05.8235770Z test cli::tests::shell_owner_exclusivity_negatives ... ok
2026-07-31T06:00:06.1378889Z test cli::tests::shell_relink_relaunches_offline_instances_only ... ok
2026-07-31T06:00:06.1393479Z test picker::data::tests::resume_rows_derive_per_row_project_and_drop_owlery_sessions ... ok
2026-07-31T06:00:06.3749616Z test cli::tests::shell_spawn_approval_floor_gates ... ok
2026-07-31T06:00:06.3855007Z test picker::data::tests::row_status_drives_unbound_display ... ok
2026-07-31T06:00:07.2236924Z test cli::tests::shell_spawn_cap_and_over_cap_gates ... ok
2026-07-31T06:00:07.2237802Z test picker::model::tests::adapter_tree_nests_profiles ... ok
2026-07-31T06:00:07.2239699Z test picker::model::tests::back_unwinds ... ok
2026-07-31T06:00:07.2242002Z test picker::model::tests::build_project_choices_head_here_rest ... ok
2026-07-31T06:00:07.2243322Z test picker::model::tests::category_labels_render_display_forms ... ok
2026-07-31T06:00:07.2244770Z test picker::model::tests::category_ring_wraps ... ok
2026-07-31T06:00:07.2248933Z test picker::model::tests::change_adapter_picks_and_returns_to_confirm ... ok
2026-07-31T06:00:07.2250888Z test picker::model::tests::choose_project_outcome_bakes_cwd_and_diverts ... ok
2026-07-31T06:00:07.2252484Z test picker::model::tests::confirm_local_offline_unchanged_by_wake_split ... ok
2026-07-31T06:00:07.2254314Z test picker::model::tests::confirm_options_remote_suspended_is_wake_not_start ... ok
2026-07-31T06:00:07.2256282Z test picker::model::tests::confirm_options_status_dependent ... ok
2026-07-31T06:00:07.2259184Z test picker::model::tests::confirm_terminal_routes ... ok
2026-07-31T06:00:07.2262250Z test picker::model::tests::confirm_terminal_wake_carries_raw_node ... ok
2026-07-31T06:00:07.2263588Z test picker::model::tests::create_new_multisubnet_inserts_home_layer ... ok
2026-07-31T06:00:07.2265137Z test picker::model::tests::create_outcome_bakes_run ... ok
2026-07-31T06:00:07.2266295Z test picker::model::tests::cursor_clamps ... ok
2026-07-31T06:00:07.2267775Z test picker::model::tests::display_mapping_matrix ... ok
2026-07-31T06:00:07.2269063Z test picker::model::tests::display_status_four_state_type_gated ... ok
2026-07-31T06:00:07.2270464Z test picker::model::tests::display_status_unbound_is_hollow_and_attachable ... ok
2026-07-31T06:00:07.2271910Z test picker::model::tests::empty_scope_opens_create ... ok
2026-07-31T06:00:07.2279048Z test picker::model::tests::ep_display_glyph_and_square_palette ... ok
2026-07-31T06:00:07.2279550Z test picker::model::tests::esc_backs_out_of_home_layer ... ok
2026-07-31T06:00:07.2281448Z test picker::model::tests::filter_narrows ... ok
2026-07-31T06:00:07.2285085Z test picker::model::tests::from_resource_row_maps_gossiped_adapter_projects_controlled ... ok
2026-07-31T06:00:07.2287858Z test picker::model::tests::home_selection_bakes_into_run_subnet ... ok
2026-07-31T06:00:07.2288954Z test picker::model::tests::kind_routes ... ok
2026-07-31T06:00:07.2290947Z test picker::model::tests::launch_keys_live_only_on_launch_capable_highlights ... ok
2026-07-31T06:00:07.2292403Z test picker::model::tests::prefill_jumps_to_create ... ok
2026-07-31T06:00:07.2294395Z test picker::model::tests::project_filter_keys_on_slug_while_tab_renders_display ... ok
2026-07-31T06:00:07.2295842Z test picker::model::tests::purge_confirm_yields_outcome_and_backs_out ... ok
2026-07-31T06:00:07.2297254Z test picker::model::tests::purge_shortcut_gates_to_offline_local ... ok
2026-07-31T06:00:07.2298778Z test picker::model::tests::reenter_create_keeps_or_clears_id ... ok
2026-07-31T06:00:07.2300224Z test picker::model::tests::remove_endpoint_drops_row_and_clamps_cursor ... ok
2026-07-31T06:00:07.2301736Z test picker::model::tests::resume_outcome_adapter_follows_recorded_row ... ok
2026-07-31T06:00:07.2303009Z test picker::model::tests::resume_outcome_bakes_session ... ok
2026-07-31T06:00:07.2305474Z test picker::model::tests::resume_title_render ... ok
2026-07-31T06:00:07.2306631Z test picker::model::tests::should_offer_project_choice_fire_conditions ... ok
2026-07-31T06:00:07.2307821Z test picker::model::tests::single_subnet_skips_home_layer ... ok
2026-07-31T06:00:07.2308971Z test picker::model::tests::suspended_is_distinct_from_offline ... ok
2026-07-31T06:00:07.2310458Z test picker::model::tests::visible_partitions_and_sorts ... ok
2026-07-31T06:00:07.2312225Z test picker::shortcut::tests::bakes_create_attach_by_default ... ok
2026-07-31T06:00:07.2313887Z test picker::shortcut::tests::bakes_resume_and_action ... ok
2026-07-31T06:00:07.2315164Z test picker::shortcut::tests::basename_is_parameterized ... ok
2026-07-31T06:00:07.2316327Z test picker::shortcut::tests::sentinel_detection ... ok
2026-07-31T06:00:07.2567557Z test picker::shortcut::tests::write_create_update_refuse ... ok
2026-07-31T06:00:07.2568984Z test picker::tests::backspace_backs_out_screens_like_esc ... ok
2026-07-31T06:00:07.2570363Z test picker::tests::backspace_stays_char_delete_in_text_contexts ... ok
2026-07-31T06:00:07.2571463Z test picker::tests::purge_outcomes_convert_to_flash_lines ... ok
2026-07-31T06:00:07.2626334Z test picker::tests::purge_transition_reconstructs_the_complete_screen_after_external_mutation ... ok
2026-07-31T06:00:07.2652529Z test picker::view::tests::adapter_tree_buffer ... ok
2026-07-31T06:00:07.2677969Z test picker::view::tests::change_adapter_screen_renders_tree_and_apply_legend ... ok
2026-07-31T06:00:07.2707337Z test picker::view::tests::choose_project_buffer_keeps_confirm_panel ... ok
2026-07-31T06:00:07.2740665Z test picker::view::tests::confirm_buffer_options ... ok
2026-07-31T06:00:07.2770945Z test picker::view::tests::confirm_fork_and_shortcut_labels_are_dir_relative ... ok
2026-07-31T06:00:07.2805981Z test picker::view::tests::confirm_panel_history_renders_display_not_slug ... ok
2026-07-31T06:00:07.2830259Z test picker::view::tests::create_home_lists_subnets ... ok
2026-07-31T06:00:07.2881753Z test picker::view::tests::footer_hints_h_s_only_when_launch_keys_live ... ok
2026-07-31T06:00:07.2904747Z test picker::view::tests::kind_buffer ... ok
2026-07-31T06:00:07.2937469Z test picker::view::tests::pick_buffer_has_squares_and_description ... ok
2026-07-31T06:00:07.2969284Z test picker::view::tests::pick_empty_category_hint ... ok
2026-07-31T06:00:07.3165281Z test picker::view::tests::pick_status_line_four_state ... ok
2026-07-31T06:00:07.3193273Z test picker::view::tests::resume_buffer_keeps_confirm_panel ... ok
2026-07-31T06:00:07.3224435Z test picker::view::tests::resume_buffer_lists_sessions ... ok
2026-07-31T06:00:19.3815614Z test cli::tests::shell_spawn_gates_on_the_registered_set ... ok
2026-07-31T06:00:19.3817091Z test rc::tests::attach_gate_routes_on_session_truth_not_the_row ... ok
2026-07-31T06:00:19.4321666Z test cli::tests::shell_spawn_profiled_option_resolves_and_shares_cap ... ok
2026-07-31T06:00:19.5521975Z test cli::tests::shutdown_and_stop_share_the_postcondition_and_differ_only_in_ceremony ... ok
2026-07-31T06:00:19.5523005Z test rc::tests::bracketed_paste_framing_is_exact_and_content_verbatim ... ok
2026-07-31T06:00:19.5524337Z test rc::tests::broker_host_child ... ok
2026-07-31T06:00:19.5525933Z test rc::tests::canonical_wire_id_strips_qualifiers_to_the_bare_id ... ok
2026-07-31T06:00:19.5527324Z test rc::tests::classify_read_err_eof_is_graceful_not_fatal ... ok
2026-07-31T06:00:19.5529148Z test rc::tests::clipboard_paste_wraps_nonempty_and_noops_on_empty_or_failure ... ok
2026-07-31T06:00:19.5530501Z test rc::tests::detach_keybind_semantics ... ok
2026-07-31T06:00:19.5532014Z test rc::tests::detach_prefix_spans_chunks ... ok
2026-07-31T06:00:19.5533534Z test rc::tests::display_guard_postlude_exactly_once_and_inactive_silent ... ok
2026-07-31T06:00:19.5535148Z test rc::tests::driver_phrase_names_own_node_plainly_but_remote_verbatim ... ok
2026-07-31T06:00:19.6519885Z test cli::tests::shutdown_on_a_broker_hosted_endpoint_stamps_after_the_reap ... ok
2026-07-31T06:00:19.6521212Z test rc::tests::first_event_stall_decision ... ok
2026-07-31T06:00:19.6523004Z test rc::tests::fold_code_key_prompt_rules ... ok
2026-07-31T06:00:19.6524789Z test rc::tests::give_up_copy_names_daemon_down_vs_generic ... ok
2026-07-31T06:00:19.6526317Z test rc::tests::harness_only_row_matches_online_seatless_live_agents_only ... ok
2026-07-31T06:00:19.6527464Z test rc::tests::identity_line_format ... ok
2026-07-31T06:00:19.6529533Z test rc::tests::key_event_step_detach_sm ... ok
2026-07-31T06:00:19.6531159Z test rc::tests::mouse_is_paste_only_right_button_down ... ok
2026-07-31T06:00:19.6533082Z test rc::tests::mouse_mode_decset_scan_survives_split_across_chunks ... ok
2026-07-31T06:00:19.6534504Z test rc::tests::mouse_mode_decset_scan_tracks_enable_and_sgr ... ok
2026-07-31T06:00:19.6538171Z test rc::tests::op_minter_distinct_and_monotonic ... ok
2026-07-31T06:00:19.6539280Z test rc::tests::pre_broker_busy_guidance_fires_for_any_driver_not_just_remote ... ok
2026-07-31T06:00:19.6540555Z test rc::tests::public_attach_failure_maps_deadline_class_only ... ok
2026-07-31T06:00:19.6542240Z test rc::tests::pump_status_emit_sequence_over_write_sink ... ok
2026-07-31T06:00:19.6941729Z test cli::tests::shutdown_on_a_harness_hosted_endpoint_claims_no_process ... ok
2026-07-31T06:00:19.6942862Z test rc::tests::reassert_scanner_survives_split_across_chunks ... ok
2026-07-31T06:00:19.6944232Z test rc::tests::reassert_scanner_triggers_only_on_region_destroyers ... ok
2026-07-31T06:00:19.6946147Z test rc::tests::reconnect_banner_clears_and_centers ... ok
2026-07-31T06:00:19.6947390Z test rc::tests::reconnect_banner_shows_the_countdown ... ok
2026-07-31T06:00:19.6948724Z test rc::tests::reconnect_class_only_severed_transport_redrives ... ok
2026-07-31T06:00:19.6949883Z test rc::tests::reconnect_remaining_secs_counts_down_ceil ... ok
2026-07-31T06:00:19.6950958Z test rc::tests::reconnect_window_expiry_decision ... ok
2026-07-31T06:00:19.6952199Z test rc::tests::scroll_dir_classifies_wheel_only ... ok
2026-07-31T06:00:19.6953450Z test rc::tests::scroll_sgr_emits_exact_xterm_bytes ... ok
2026-07-31T06:00:19.6954809Z test rc::tests::serve_eof_severed_vs_refused ... ok
2026-07-31T06:00:19.6956210Z test rc::tests::status_assert_reserves_row1_then_repaints ... ok
2026-07-31T06:00:19.6957305Z test rc::tests::status_repaint_exact_bytes_and_right_align ... ok
2026-07-31T06:00:19.6958477Z test rc::tests::status_restore_exact_bytes ... ok
2026-07-31T06:00:19.6960013Z test rc::tests::status_row_marker_is_disabled_by_flag ... ok
2026-07-31T06:00:19.6961367Z test rc::tests::status_update_size_repoints_geometry ... ok
2026-07-31T06:00:19.6962922Z test rc::tests::teardown_matrix_postlude_precedes_prose_across_every_final_class ... ok
2026-07-31T06:00:19.6963989Z test rc::tests::the_client_refuses_engine_room_viewports_and_qualified_targets_only ... ok
2026-07-31T06:00:19.6965660Z test rc::tests::translate_key_event_emits_exact_xterm_vt ... ok
2026-07-31T06:00:19.6966688Z test rc::tests::with_vt_output_disables_newline_auto_return ... ok
2026-07-31T06:00:19.6967929Z test rc::tests::with_vt_output_enables_virtual_terminal_processing ... ok
2026-07-31T06:00:19.8466273Z test cli::tests::spt_hosted_no_relay_detection ... ok
2026-07-31T06:00:19.9189890Z test picker::data::tests::gather_endpoints_projects_from_seeded_index_with_zero_git ... ok
2026-07-31T06:00:19.9850883Z test picker::data::tests::gather_renders_live_unbound ... ok
2026-07-31T06:00:20.1970824Z test picker::data::tests::home_subnet_options_is_mru_ordered ... ok
2026-07-31T06:00:20.2126487Z test picker::data::tests::own_node_tab_label_falls_back_to_keyprefix ... ok
2026-07-31T06:00:20.2888638Z test picker::data::tests::picker_excludes_flat_worker_and_psyche ... ok
2026-07-31T06:00:20.3056344Z test picker::data::tests::remote_picker_renders_suspended_dead_perch_offline ... ok
2026-07-31T06:00:20.3057798Z test roster::tests::match_self_by_ancestry_disambiguates_and_none ... ok
2026-07-31T06:00:20.3240354Z test picker::data::tests::remote_rows_render_full_palette_parity ... ok
2026-07-31T06:00:20.3242875Z test teardown::tests::an_unconfirmed_row_over_a_dead_root_is_stale_not_a_survivor ... ok
2026-07-31T06:00:20.3406803Z test picker::data::tests::resume_rows_title_from_index_cwd_map_with_pure_fallback ... ok
2026-07-31T06:00:20.3411185Z test teardown::tests::timeout_refuses_the_stamp_and_names_the_survivor ... ok
2026-07-31T06:00:20.3412858Z test teardown::tests::topology_gate_is_controllable_true_only ... ok
2026-07-31T06:00:20.3415055Z test tests::broken_pipe_panic_classifier ... ok
2026-07-31T06:00:20.3417448Z test wansend::tests::bare_id_resolves_across_remote_snapshot ... ok
2026-07-31T06:00:20.3420500Z test wansend::tests::classify_wan_reply_only_delivers_on_positive_outcomes ... ok
2026-07-31T06:00:20.3551426Z test wansend::tests::load_snapshots_degrades_on_junk ... ok
2026-07-31T06:00:20.3553579Z test wansend::tests::refusals_render_copy_paste_targets ... ok
2026-07-31T06:00:20.3606706Z test picker::data::tests::shared_machine_is_one_group_with_unioned_subnets ... ok
2026-07-31T06:00:20.3665090Z test teardown::tests::liveness_proof_needs_a_real_snapshot_and_finds_this_process ... ok
2026-07-31T06:00:20.3812819Z test rc::tests::attach_against_stopped_daemon_never_spawns_and_exits_loud ... ok
2026-07-31T06:00:20.4115323Z test rc::tests::attach_offline_endpoint_short_circuits_clean ... ok
2026-07-31T06:00:20.5017082Z 
2026-07-31T06:00:20.5017399Z running 1 test
2026-07-31T06:00:20.5784671Z NTP_TOTP_UNCORRECTED: all NTP servers unreachable — ceremony clock = raw system clock
2026-07-31T06:00:20.5891595Z CONN_LIFECYCLE: conn=1 role=brain wall_ms=1785477620588 mono_ms=0 event=transport-close poisoned=false timed_out=false [REQ-CONN-POISON-ATTRIBUTION]
2026-07-31T06:00:20.5895702Z CONN_LIFECYCLE: conn=3 role=brain wall_ms=1785477620589 mono_ms=0 event=write-start [REQ-CONN-POISON-ATTRIBUTION]
2026-07-31T06:00:20.6211174Z CONN_LIFECYCLE: conn=2 role=brain controller session=1 endpoint=reheal by=local wall_ms=1785477620620 mono_ms=31 event=controller-attach session=1 from_seq=0 [REQ-CONN-POISON-ATTRIBUTION]
2026-07-31T06:00:20.6217009Z CONN_LIFECYCLE: conn=2 role=brain controller session=1 endpoint=reheal by=local wall_ms=1785477620621 mono_ms=32 event=write-start [REQ-CONN-POISON-ATTRIBUTION]
2026-07-31T06:00:20.6227668Z CONN_LIFECYCLE: conn=4 role=brain wall_ms=1785477620622 mono_ms=33 event=write-start [REQ-CONN-POISON-ATTRIBUTION]
2026-07-31T06:00:20.6380738Z CONN_LIFECYCLE: conn=4 role=brain stream-subscriber stream=2 wall_ms=1785477620637 mono_ms=48 event=stream-sub-attach stream=2 from_seq=0 [REQ-CONN-POISON-ATTRIBUTION]
2026-07-31T06:00:20.6404573Z CONN_LIFECYCLE: conn=5 role=brain wall_ms=1785477620640 mono_ms=51 event=write-start [REQ-CONN-POISON-ATTRIBUTION]
2026-07-31T06:00:20.6406612Z CONN_LIFECYCLE: conn=5 role=brain wall_ms=1785477620640 mono_ms=51 event=transport-close poisoned=false timed_out=false [REQ-CONN-POISON-ATTRIBUTION]
2026-07-31T06:00:20.6410159Z CONN_LIFECYCLE: conn=6 role=brain wall_ms=1785477620640 mono_ms=51 event=write-start [REQ-CONN-POISON-ATTRIBUTION]
2026-07-31T06:00:20.6432137Z CONN_LIFECYCLE: conn=6 role=brain stream-subscriber stream=1 wall_ms=1785477620641 mono_ms=52 event=stream-sub-attach stream=1 from_seq=0 [REQ-CONN-POISON-ATTRIBUTION]
2026-07-31T06:00:20.6455106Z CONN_LIFECYCLE: conn=6 role=brain stream-subscriber stream=1 viewer session=1 endpoint=reheal vid=0 wall_ms=1785477620643 mono_ms=54 event=viewer-attach session=1 vid=0 from_seq=0 [REQ-CONN-POISON-ATTRIBUTION]
2026-07-31T06:00:20.6457122Z SUBSCRIBE_DECISION: session=1 endpoint=reheal by=fd1724385aa0c75b64fb78cd602fa1d991fdebf76b13c58ed702eac835e9f618 conn=6 intent=viewer old_by=- old_gen=0 req_gen=0 decision=viewer
2026-07-31T06:00:20.6460697Z CONN_LIFECYCLE: conn=6 role=brain stream-subscriber stream=1 viewer session=1 endpoint=reheal vid=0 viewer session=1 endpoint=reheal vid=1 wall_ms=1785477620644 mono_ms=55 event=viewer-attach session=1 vid=1 from_seq=0 [REQ-CONN-POISON-ATTRIBUTION]
2026-07-31T06:00:20.6464808Z SUBSCRIBE_DECISION: session=1 endpoint=reheal by=fd1724385aa0c75b64fb78cd602fa1d991fdebf76b13c58ed702eac835e9f618 conn=6 intent=viewer old_by=- old_gen=0 req_gen=0 decision=viewer
2026-07-31T06:00:20.8377524Z 
2026-07-31T06:00:20.8377809Z running 1 test
2026-07-31T06:00:20.8895781Z NTP_TOTP_UNCORRECTED: all NTP servers unreachable — ceremony clock = raw system clock
2026-07-31T06:00:20.9250275Z CONN_LIFECYCLE: conn=1 role=brain wall_ms=1785477620924 mono_ms=0 event=transport-close poisoned=false timed_out=false [REQ-CONN-POISON-ATTRIBUTION]
2026-07-31T06:00:20.9251490Z CONN_LIFECYCLE: conn=3 role=brain wall_ms=1785477620924 mono_ms=0 event=write-start [REQ-CONN-POISON-ATTRIBUTION]
2026-07-31T06:00:20.9476751Z CONN_LIFECYCLE: conn=2 role=brain controller session=1 endpoint=reheal by=local wall_ms=1785477620947 mono_ms=22 event=controller-attach session=1 from_seq=0 [REQ-CONN-POISON-ATTRIBUTION]
2026-07-31T06:00:20.9482576Z CONN_LIFECYCLE: conn=2 role=brain controller session=1 endpoint=reheal by=local wall_ms=1785477620948 mono_ms=23 event=write-start [REQ-CONN-POISON-ATTRIBUTION]
2026-07-31T06:00:21.6823382Z CONN_LIFECYCLE: conn=4 role=brain wall_ms=1785477621682 mono_ms=757 event=write-start [REQ-CONN-POISON-ATTRIBUTION]
2026-07-31T06:00:21.6971376Z CONN_LIFECYCLE: conn=4 role=brain stream-subscriber stream=2 wall_ms=1785477621697 mono_ms=772 event=stream-sub-attach stream=2 from_seq=0 [REQ-CONN-POISON-ATTRIBUTION]
2026-07-31T06:00:21.7335608Z CONN_LIFECYCLE: conn=5 role=brain wall_ms=1785477621733 mono_ms=808 event=write-start [REQ-CONN-POISON-ATTRIBUTION]
2026-07-31T06:00:21.7336573Z CONN_LIFECYCLE: conn=5 role=brain wall_ms=1785477621733 mono_ms=808 event=transport-close poisoned=false timed_out=false [REQ-CONN-POISON-ATTRIBUTION]
2026-07-31T06:00:21.7339888Z CONN_LIFECYCLE: conn=6 role=brain wall_ms=1785477621733 mono_ms=809 event=write-start [REQ-CONN-POISON-ATTRIBUTION]
2026-07-31T06:00:21.7341701Z CONN_LIFECYCLE: conn=6 role=brain stream-subscriber stream=1 wall_ms=1785477621734 mono_ms=809 event=stream-sub-attach stream=1 from_seq=0 [REQ-CONN-POISON-ATTRIBUTION]
2026-07-31T06:00:21.7344701Z CONN_LIFECYCLE: conn=6 role=brain stream-subscriber stream=1 viewer session=1 endpoint=reheal vid=0 wall_ms=1785477621734 mono_ms=809 event=viewer-attach session=1 vid=0 from_seq=0 [REQ-CONN-POISON-ATTRIBUTION]
2026-07-31T06:00:21.7346960Z SUBSCRIBE_DECISION: session=1 endpoint=reheal by=fd1724385aa0c75b64fb78cd602fa1d991fdebf76b13c58ed702eac835e9f618 conn=6 intent=viewer old_by=- old_gen=0 req_gen=0 decision=viewer
2026-07-31T06:00:21.7348301Z CONN_LIFECYCLE: conn=6 role=brain stream-subscriber stream=1 viewer session=1 endpoint=reheal vid=0 viewer session=1 endpoint=reheal vid=1 wall_ms=1785477621734 mono_ms=809 event=viewer-attach session=1 vid=1 from_seq=0 [REQ-CONN-POISON-ATTRIBUTION]
2026-07-31T06:00:21.7350802Z SUBSCRIBE_DECISION: session=1 endpoint=reheal by=fd1724385aa0c75b64fb78cd602fa1d991fdebf76b13c58ed702eac835e9f618 conn=6 intent=viewer old_by=- old_gen=0 req_gen=0 decision=viewer
2026-07-31T06:00:22.0578277Z CONN_LIFECYCLE: conn=6 role=brain stream-subscriber stream=1 viewer session=1 endpoint=reheal vid=0 viewer session=1 endpoint=reheal vid=1 wall_ms=1785477622057 mono_ms=1132 event=stream-sub-release stream=1 [REQ-CONN-POISON-ATTRIBUTION]
2026-07-31T06:00:22.0579522Z CONN_LIFECYCLE: conn=7 role=brain wall_ms=1785477622057 mono_ms=1132 event=transport-close poisoned=false timed_out=false [REQ-CONN-POISON-ATTRIBUTION]
2026-07-31T06:00:22.0691266Z test rc::tests::attach_viewport_reconnects_across_a_broker_bounce ... ok
2026-07-31T06:00:22.8051768Z test rc::tests::establish_attach_reuses_the_probes_carried_pump_conn ... ok
2026-07-31T06:00:27.7000865Z test rc::tests::qualified_targets_attach_with_bare_wire_id ... ok
2026-07-31T06:00:27.7096841Z test roster::tests::detect_self_by_ancestry_none_when_no_ancestor_owns_a_perch ... ok
2026-07-31T06:00:27.7312165Z test roster::tests::detect_self_by_ancestry_resolves_a_live_ancestor_perch ... ok
2026-07-31T06:00:27.7445162Z test roster::tests::detect_self_id_endpoint_id_leg_is_label_only_and_perch_gated ... ok
2026-07-31T06:00:27.7805937Z test roster::tests::detect_self_id_resolves_identity_with_zero_git_spawns ... ok
2026-07-31T06:00:27.7899245Z test roster::tests::detect_self_resolves_spt_hosted_perch_via_parent_pid ... ok
2026-07-31T06:00:27.7920095Z test roster::tests::enumerate_yields_offline_corrupt_row_for_unparseable_info ... ok
2026-07-31T06:00:27.8135521Z test roster::tests::list_all_perch_dirs_enumerates_nested_psyche_for_self_resolution ... ok
2026-07-31T06:00:27.8366233Z test roster::tests::parent_pid_candidates_stay_ancestry_gated ... ok
2026-07-31T06:00:28.2522543Z test wansend::tests::remote_rest_suspends_and_wakes_with_the_deferred_gate ... ok
2026-07-31T06:00:28.3241499Z test wansend::tests::resolve_and_dial_owner_dials_the_resolved_node ... ok
2026-07-31T06:00:28.3680888Z test wansend::tests::resolve_and_dial_owner_is_honest_on_resolution_misses ... ok
2026-07-31T06:00:28.3787561Z test wansend::tests::seed_first_addr_prefers_the_cached_direct_address ... ok
2026-07-31T06:00:29.2379682Z test wansend::tests::wan_send_ships_to_the_resolved_node ... ok
2026-07-31T06:00:29.2379946Z 
2026-07-31T06:00:29.2380181Z test result: ok. 475 passed; 0 failed; 0 ignored; 0 measured; 0 filtered out; finished in 84.16s
2026-07-31T06:00:29.2380517Z 
2026-07-31T06:00:29.2626116Z      Running unittests tests\fixtures\translate_proof_fixture.rs (target\debug\deps\translate_proof_fixture-6c1f32e3e25e0c2c.exe)
2026-07-31T06:00:29.8875969Z 
2026-07-31T06:00:29.8876306Z running 0 tests
2026-07-31T06:00:29.8876463Z 
2026-07-31T06:00:29.8876717Z test result: ok. 0 passed; 0 failed; 0 ignored; 0 measured; 0 filtered out; finished in 0.00s
2026-07-31T06:00:29.8877051Z 
2026-07-31T06:00:29.8962249Z      Running unittests src\lib.rs (target\debug\deps\spt_daemon-4d86a85ce347685e.exe)
2026-07-31T06:00:31.0976078Z 
2026-07-31T06:00:31.0976506Z running 723 tests
2026-07-31T06:00:31.0982939Z test access::tests::the_inbound_lock_answers_replies_only_and_only_while_controlled ... ok
2026-07-31T06:00:31.0983540Z test access::tests::the_knock_exemption_hook_refuses_everything_today ... ok
2026-07-31T06:00:31.0987833Z test activity::tests::a_state_change_owes_a_push_both_directions ... ok
2026-07-31T06:00:31.0988570Z test activity::tests::a_token_change_with_an_identical_state_owes_a_push ... ok
2026-07-31T06:00:31.0989322Z test activity::tests::an_identical_observation_pushes_nothing ... ok
2026-07-31T06:00:31.0989855Z test activity::tests::an_unseen_link_owes_a_push ... ok
2026-07-31T06:00:31.0992389Z test activity::tests::remember_forgets_a_vanished_link_so_its_return_re_pushes ... ok
2026-07-31T06:00:31.0994166Z test activity::tests::the_diff_is_per_link_not_per_owner ... ok
2026-07-31T06:00:31.0999146Z test activity::tests::observe_links_on_an_absent_owlery_is_empty ... ok
2026-07-31T06:00:31.1000817Z test adapter_update::tests::delegated_attested_delegates_command ... ok
2026-07-31T06:00:31.1002435Z test adapter_update::tests::delegated_unattested_is_skipped ... ok
2026-07-31T06:00:31.1023277Z test activity::tests::the_flip_marker_is_idempotent_to_drop_and_taken_exactly_once ... ok
2026-07-31T06:00:31.1115113Z test adapter_update::tests::file_pull_tampered_bytes_rejected ... ok
2026-07-31T06:00:31.1118576Z test adapter_update::tests::file_pull_without_payload_is_skipped ... ok
2026-07-31T06:00:31.1119055Z test adapter_update::tests::file_pull_verified_against_adapter_key ... ok
2026-07-31T06:00:31.1120610Z test adapter_update::tests::gh_release_is_managed_cli_side_not_in_pure_plan ... ok
2026-07-31T06:00:31.1121498Z test activity::tests::an_owner_with_no_linked_shell_is_not_observed ... ok
2026-07-31T06:00:31.1129432Z test access::tests::corrupt_store_degrades_closed_but_replies_survive ... ok
2026-07-31T06:00:31.1186258Z test activity::tests::an_unstamped_owner_observes_undated_and_stays_silent_across_sweeps ... ok
2026-07-31T06:00:31.1186942Z test activity::tests::observe_links_sees_only_online_shells_holding_a_token ... ok
2026-07-31T06:00:31.1345618Z test adapter_update::tests::ripple_conducts_each_adapter_in_order ... ok
2026-07-31T06:00:31.1346106Z test adapter_update::tests::file_pull_wrong_key_rejected ... ok
2026-07-31T06:00:31.1479315Z test access::tests::gate_decision_table ... ok
2026-07-31T06:00:31.1535127Z test adapter_update::tests::ripple_registered_uses_the_registered_set ... ok
2026-07-31T06:00:31.1582852Z test applyhost::tests::apply_staged_daemonless_swaps_binary_with_no_broker ... ok
2026-07-31T06:00:31.1656345Z test access::tests::reply_passes_where_unsolicited_refused ... ok
2026-07-31T06:00:31.1699032Z test applyhost::tests::apply_staged_daemonless_holds_the_fail_closed_gates ... ok
2026-07-31T06:00:31.1731910Z test applyhost::tests::brain_restart_verb_raises_the_supervisor_signal ... ok
2026-07-31T06:00:31.1749791Z test applyhost::tests::broker_reports_its_compiled_image_version_over_ipc ... ok
2026-07-31T06:00:31.1752846Z test applyhost::tests::apply_staged_update_set_refuses_broker_touching_payloads ... ok
2026-07-31T06:00:31.1754347Z test applyhost::tests::staged_already_applied_classifies_up_to_date_vs_newer ... ok
2026-07-31T06:00:31.1757380Z test attach::tests::the_engine_room_has_no_viewport_and_takes_its_controls_from_home ... ok
2026-07-31T06:00:31.1766241Z test applyhost::tests::refresh_brain_cycles_without_staging_or_swap_preconditions ... ok
2026-07-31T06:00:31.1772414Z test access::tests::discover_gate_discloses_per_viewer ... ok
2026-07-31T06:00:31.1838537Z test applyhost::tests::apply_staged_refuses_platform_blind_or_mismatched_single ... ok
2026-07-31T06:00:31.1849351Z test applyhost::tests::apply_staged_refuses_a_quarantined_version ... ok
2026-07-31T06:00:31.1854508Z test brain::tests::a_flagged_sync_frame_baselines_forward_never_backward_on_both_paths ... ok
2026-07-31T06:00:31.1856584Z test brain::tests::an_old_broker_wire_without_the_sync_key_keeps_every_legacy_path ... ok
2026-07-31T06:00:31.1858400Z test applyhost::tests::apply_staged_gates_fail_closed_with_the_seat_untouched ... ok
2026-07-31T06:00:31.1860306Z test brain::tests::peer_reply_deadline_caps_below_carrier_deadline ... ok
2026-07-31T06:00:31.1861682Z test brain::tests::cold_brain_still_rejects_a_forward_output_gap ... ok
2026-07-31T06:00:31.1862525Z test brain::tests::reclassify_peer_reply_maps_timeout_off_poison ... ok
2026-07-31T06:00:31.1867969Z test brain::tests::controller_resume_from_floor_refetches_after_a_gap ... ok
2026-07-31T06:00:31.1869031Z test brain::tests::skip_to_live_accepts_a_forward_seq_jump_via_snap_above ... ok
2026-07-31T06:00:31.1870020Z test brain::tests::viewer_snap_attach_accepts_a_forward_output_gap ... ok
2026-07-31T06:00:31.1870525Z test brainproc::tests::appended_padding_flips_exe_hash ... ok
2026-07-31T06:00:31.1870997Z test brainproc::tests::backoff_doubles_on_fast_death_resets_when_healthy ... ok
2026-07-31T06:00:31.1871954Z test brainproc::tests::brain_child_args_carry_generation_and_reason ... ok
2026-07-31T06:00:31.1872419Z test brainproc::tests::bytes_gate_truth_table ... ok
2026-07-31T06:00:31.1873443Z test brainproc::tests::consumer_gate_spawns_once_when_net_enabled ... ok
2026-07-31T06:00:31.1918420Z test applyhost::tests::apply_staged_without_broker_hosted_sessions_swaps_binary ... ok
2026-07-31T06:00:31.1975157Z test access::tests::the_inbound_lock_is_reached_through_the_sender_stamped_entry_point ... ok
2026-07-31T06:00:31.2061458Z test access::tests::gate_is_per_surface ... ok
2026-07-31T06:00:31.2106003Z test access::tests::discover_gate_withholds_everything_while_degraded ... ok
2026-07-31T06:00:31.2107882Z test brainproc::tests::ready_exe_hash_parses_and_is_n1_readable ... ok
2026-07-31T06:00:31.2168219Z test brainproc::tests::ready_generation_at_reads_file_and_absent_is_none ... ok
2026-07-31T06:00:31.2169840Z test brainproc::tests::ready_generation_parses_stamp_and_fails_safe ... ok
2026-07-31T06:00:31.2329916Z test access::tests::same_node_always_passes_without_minting ... ok
2026-07-31T06:00:31.2331306Z test brainproc::tests::rollback_running_version_is_prior_not_n_minus_one ... ok
2026-07-31T06:00:31.3212644Z test access::tests::the_engine_room_is_disclosed_only_to_the_viewers_it_chose ... ok
2026-07-31T06:00:31.3213722Z test brainproc::tests::select_brain_exe_prefers_canonical_over_per_spawn_current_exe ... ok
2026-07-31T06:00:31.3400384Z test access::tests::the_engine_room_refuses_even_this_nodes_own_unsolicited_inbound ... ok
2026-07-31T06:00:31.3401874Z test brainproc::tests::start_reason_arg_round_trips_and_is_lenient ... ok
2026-07-31T06:00:31.3488226Z test access::tests::gate_feeds_the_proven_sender_endpoint_tier ... ok
2026-07-31T06:00:31.3514457Z test attach::tests::viewer_and_driving_intents_gate_on_different_surfaces ... ok
2026-07-31T06:00:31.3522163Z test autostart::tests::empty_config_is_a_pure_noop ... ok
2026-07-31T06:00:31.3605657Z test autostart::tests::unresolved_adapter_loud_skips_before_any_launch ... ok
2026-07-31T06:00:31.7846392Z test applyhost::tests::apply_staged_swaps_binary_and_hands_off_without_touching_the_endpoint ... ok
2026-07-31T06:00:31.7861192Z test broker::tests::a_controller_resume_below_the_floor_is_served_the_repaint_shape ... ok
2026-07-31T06:00:31.7864993Z test broker::tests::a_failed_surface_resize_leaves_the_grid_geometry_unchanged ... ok
2026-07-31T06:00:31.7880740Z test broker::tests::a_full_controller_does_not_starve_a_viewer_or_block_the_drain ... ok
2026-07-31T06:00:31.7893134Z test broker::tests::a_gap_resume_on_the_same_conn_is_served_not_suppressed ... ok
2026-07-31T06:00:31.7896400Z test broker::tests::a_grow_keeps_old_geometry_wrapping_and_places_new_output_at_the_new_width ... ok
2026-07-31T06:00:31.7958629Z test applyhost::tests::apply_staged_update_set_selects_local_platform_artifact ... ok
2026-07-31T06:00:31.7971745Z test broker::tests::a_resume_at_the_floor_keeps_the_raw_ring_replay ... ok
2026-07-31T06:00:31.7985256Z test broker::tests::a_resumed_controller_never_rereceives_a_suppressed_seq ... ok
2026-07-31T06:00:31.7987331Z test broker::tests::a_second_transition_is_refused_while_one_is_in_flight ... ok
2026-07-31T06:00:31.7990002Z test broker::tests::a_shrink_parses_held_output_at_the_geometry_it_was_emitted_under ... ok
2026-07-31T06:00:31.8619058Z test broker::tests::a_reap_clears_the_control_stamps_but_never_the_hosting_authority ... ok
2026-07-31T06:00:32.0990231Z test broker::tests::a_take_and_a_detach_each_drop_the_engine_rooms_empowerments ... ok
2026-07-31T06:00:32.0991518Z test broker::tests::advance_delivered_is_monotonic ... ok
2026-07-31T06:00:32.1003229Z test broker::tests::an_aborted_transition_syncs_at_the_old_geometry_with_no_size_frame ... ok
2026-07-31T06:00:32.1011260Z test broker::tests::append_overflow_flags_the_evicted_viewer_for_skip_to_live ... ok
2026-07-31T06:00:32.1024268Z test broker::tests::apply_once_enqueues_ptywrite_exactly_once_and_dedups_replay ... ok
2026-07-31T06:00:32.3562498Z test broker::tests::a_viewer_below_the_floor_gets_the_repaint_and_skip_to_live_stays_empty ... ok
2026-07-31T06:00:32.3563058Z test broker::tests::chunk_text_splits_and_reassembles_exactly ... ok
2026-07-31T06:00:32.3563433Z test broker::tests::clamp_or_reset_resets_a_torn_ring_only ... ok
2026-07-31T06:00:32.3612918Z test broker::tests::cold_attach_repaint_plus_next_differential_matches_independent_emulator ... ok
2026-07-31T06:00:32.3619031Z test broker::tests::contains_subslice_finds_contiguous_only ... ok
2026-07-31T06:00:32.3622623Z test broker::tests::contiguous_advance_freezes_on_a_gap ... ok
2026-07-31T06:00:32.3635359Z test broker::tests::controller_write_stall_predicate_distinguishes_wedged_from_idle ... ok
2026-07-31T06:00:32.3637102Z test broker::tests::delivered_cursor_advances_only_on_ok_and_is_monotonic ... ok
2026-07-31T06:00:32.3866440Z test brainproc::tests::rolled_back_record_spawns_rollback_binary_on_a_fresh_supervisor ... ok
2026-07-31T06:00:32.3875672Z test broker::tests::echo_verified_catches_a_swallowed_head ... ok
2026-07-31T06:00:32.4155919Z test broker::tests::equal_generation_same_conn_is_an_idempotent_replay ... ok
2026-07-31T06:00:32.4156534Z test broker::tests::attach_initial_batch_is_a_clean_alt_screen_repaint_not_the_raw_ring ... ok
2026-07-31T06:00:32.4178937Z test broker::tests::gap_resume_resubscribe_preserves_the_generation_against_stale_replay ... ok
2026-07-31T06:00:32.4220188Z test broker::tests::exit_enqueues_behind_queued_output_per_sink ... ok
2026-07-31T06:00:32.4228620Z test broker::tests::generation_ladder_newer_supersedes_loudly_older_refused_both_intents ... ok
2026-07-31T06:00:32.4230232Z test broker::tests::input_enqueue_drops_and_stamps_on_full_then_heals_on_drain ... ok
2026-07-31T06:00:32.4238123Z test broker::tests::input_writer_preserves_strict_fifo_order_through_the_sole_writer ... ok
2026-07-31T06:00:32.4260517Z test broker::tests::lock_floor_recovers_a_poisoned_inject_floor ... ok
2026-07-31T06:00:32.4261018Z test broker::tests::miss_respool_is_once_then_dead_letters ... ok
2026-07-31T06:00:32.4263041Z test broker::tests::miss_strikes_exhausted_at_budget ... ok
2026-07-31T06:00:32.4265000Z test broker::tests::local_controller_wedged_scopes_to_the_brains_own_conn ... ok
2026-07-31T06:00:32.4265688Z test broker::tests::only_the_supervised_generation_can_claim_the_coordinator_image ... ok
2026-07-31T06:00:32.4267443Z test broker::tests::pair_hold_lifecycle_decisions ... ok
2026-07-31T06:00:32.4270736Z test broker::tests::rc_input_fence_scopes_to_rc_minted_non_controller_input_only ... ok
2026-07-31T06:00:32.4271163Z test broker::tests::output_log_tap_reads_bytes_since_snapshot ... ok
2026-07-31T06:00:32.4305947Z test broker::tests::read_translation_command_none_when_absent ... ok
2026-07-31T06:00:32.4329174Z test broker::tests::reap_dead_controller_clears_a_finished_writer ... ok
2026-07-31T06:00:32.4339953Z test broker::tests::reap_dead_controller_leaves_a_live_writer_untouched ... ok
2026-07-31T06:00:32.4351539Z test broker::tests::reap_evicts_a_blocked_writer_not_only_an_exited_one ... ok
2026-07-31T06:00:32.4359293Z test broker::tests::recover_log_clamps_a_poisoned_torn_ring ... ok
2026-07-31T06:00:32.4362346Z test broker::tests::recover_reopens_a_poisoned_sessions_map ... ok
2026-07-31T06:00:32.4375931Z test broker::tests::revoked_incumbent_writer_emits_the_terminal_displaced ... ok
2026-07-31T06:00:32.4390909Z test broker::tests::same_identity_resubscribe_refuses_a_stale_generation ... ok
2026-07-31T06:00:32.4392628Z test broker::tests::select_endpoints_running_adapter_filters_dedups_sorts ... ok
2026-07-31T06:00:32.4394404Z test broker::tests::sessions_reply_resume_seq_defaults_when_absent ... ok
2026-07-31T06:00:32.4395395Z test broker::tests::should_settle_rearms_on_observable_pty ... ok
2026-07-31T06:00:32.4407132Z test broker::tests::stale_generation_detach_never_clears_the_newer_controller ... ok
2026-07-31T06:00:32.4469822Z test broker::tests::read_translation_command_reads_declared ... ok
2026-07-31T06:00:32.4485306Z test broker::tests::stalled_incumbent_is_evicted_on_reattach_and_control_released ... ok
2026-07-31T06:00:32.4486038Z test broker::tests::stamp_divergence_gates_writes ... ok
2026-07-31T06:00:32.5175769Z test broker::tests::stale_snapshot_stamp_write_refused_after_reap_generation_bump ... ok
2026-07-31T06:00:32.6818714Z test brainproc::tests::exe_hash_computed_exactly_once_across_n_publishes ... ok
2026-07-31T06:00:32.6926377Z test brainproc::tests::planned_restart_respawns_with_update_reason ... ok
2026-07-31T06:00:32.7001843Z test brainproc::tests::clear_before_spawn_defeats_exact_generation_stale_file ... ok
2026-07-31T06:00:32.7030482Z test brainproc::tests::ready_but_wrong_bytes_rolls_back_never_promotes ... ok
2026-07-31T06:00:32.7037740Z test broker::tests::the_suppressed_window_is_exempt_from_the_controller_eviction_deadline ... ok
2026-07-31T06:00:32.7059383Z test broker::tests::tracked_state_inside_the_window_surfaces_in_the_sync_frame ... ok
2026-07-31T06:00:32.7078199Z test broker::tests::untracked_toggles_defer_into_the_sync_frame_and_hyperlinks_drop ... ok
2026-07-31T06:00:32.7080895Z test broker::tests::viewer_overflow_or_disconnect_evicts_never_blocks ... ok
2026-07-31T06:00:32.7085633Z test brainproc::tests::ready_but_old_gen_never_drains_does_not_promote_rolls_back ... ok
2026-07-31T06:00:32.7092270Z test broker::tests::wake_gate_decision_truth_table ... ok
2026-07-31T06:00:32.7231575Z test broker::tests::stamp_driven_by_latches_own_node_hex_verbatim_like_remote ... ok
2026-07-31T06:00:32.7232947Z test broker::tests::wrapper_alive_prefers_the_table_and_falls_back_where_there_is_none ... ok
2026-07-31T06:00:32.7234125Z test broker::tests::zombie_verdict_table ... ok
2026-07-31T06:00:32.7236000Z test codec::tests::back_to_back_frames_decode_independently ... ok
2026-07-31T06:00:32.7237947Z test codec::tests::frame_round_trips_through_buffer ... ok
2026-07-31T06:00:32.7239354Z test codec::tests::oversized_prefix_rejected ... ok
2026-07-31T06:00:32.7315372Z test config::tests::auto_suspend_knob_is_opt_in_default_off ... ok
2026-07-31T06:00:32.7405702Z test config::tests::crash_grace_is_config_driven ... ok
2026-07-31T06:00:32.7471168Z test config::tests::detached_subnets_knob_defaults_empty ... ok
2026-07-31T06:00:32.7530049Z test config::tests::full_auto_update_is_gated_by_default ... ok
2026-07-31T06:00:32.7585927Z test config::tests::malformed_file_degrades_to_default ... ok
2026-07-31T06:00:32.7591770Z test config::tests::missing_file_is_default ... ok
2026-07-31T06:00:32.7651385Z test config::tests::pulse_period_is_config_driven ... ok
2026-07-31T06:00:32.7695824Z test broker::tests::delivery_is_suppressed_during_a_transition_and_one_sync_frame_substitutes ... ok
2026-07-31T06:00:32.7767933Z test config::tests::save_load_roundtrip ... ok
2026-07-31T06:00:32.7795652Z test config::tests::startup_endpoints_roundtrip ... ok
2026-07-31T06:00:32.7834496Z test config::tests::relay_choice_is_config_driven ... ok
2026-07-31T06:00:32.7838796Z test conn::tests::conn_ids_are_unique_and_labels_stay_bounded ... ok
2026-07-31T06:00:32.7842732Z test conn::tests::organic_write_failure_still_poisons_and_is_not_the_timeout_class ... ok
2026-07-31T06:00:32.7846164Z test conn::tests::retirement_token_splits_deadline_from_organic_with_attribution_parity ... ok
2026-07-31T06:00:32.7847626Z test consent::tests::decide_honors_full_auto_flag ... ok
2026-07-31T06:00:32.8322073Z test consent::tests::no_live_session_resolves_to_none ... ok
2026-07-31T06:00:32.8778879Z test brainproc::tests::ready_candidate_promotes_once_old_gen_drains ... ok
2026-07-31T06:00:32.8986586Z test crc_swap::tests::apply_rollback_never_strands ... ok
2026-07-31T06:00:32.8987074Z test brainproc::tests::ready_with_matching_bytes_promotes ... ok
2026-07-31T06:00:32.9183488Z test broker::tests::taking_the_engine_rooms_controls_costs_a_member_or_admin_code ... ok
2026-07-31T06:00:32.9399353Z test broker::tests::superseded_controller_writer_is_epoch_gated_silent_one_live_writer_per_conn ... ok
2026-07-31T06:00:32.9821487Z test crc_swap::tests::displace_picks_fresh_old_name_and_gc_sweeps_stale ... ok
2026-07-31T06:00:33.0066664Z test crc_swap::tests::plan_recurses_nested_dirs ... ok
2026-07-31T06:00:33.0083746Z test brainproc::tests::trial_promotes_on_ready_then_supervises_the_accepted_binary ... ok
2026-07-31T06:00:33.0234402Z test crc_swap::tests::swap_error_carries_op_and_paths ... ok
2026-07-31T06:00:33.0289865Z test crc_swap::tests::plan_selects_only_changed ... ok
2026-07-31T06:00:33.0353948Z test crc_swap::tests::crash_recovery_missing_target_keeps_last_good_old ... ok
2026-07-31T06:00:33.0447887Z test crc_swap::tests::apply_swaps_changed_creates_new_untouched_identical ... ok
2026-07-31T06:00:33.0644501Z test broker::tests::windows_session_is_zombie_sees_a_handle_held_corpse_as_dead ... ok
2026-07-31T06:00:33.0728044Z test consent::tests::resolves_most_recently_active_live_session ... ok
2026-07-31T06:00:33.0729385Z test daemon::tests::drive_ladder_all_err_returns_last_err ... ok
2026-07-31T06:00:33.0730841Z test daemon::tests::drive_ladder_falls_through_to_next_rung_on_err ... ok
2026-07-31T06:00:33.0732557Z test daemon::tests::drive_ladder_picks_first_ok_rung ... ok
2026-07-31T06:00:33.0734175Z test daemon::tests::ensure_declines_only_against_a_standing_operator_stop ... ok
2026-07-31T06:00:33.0799912Z test broker::tests::supervised_worker_panic_faults_and_reaps_child ... ok
2026-07-31T06:00:33.1204386Z test broker::tests::the_engine_room_refuses_every_viewport_and_every_off_node_attach ... ok
2026-07-31T06:00:33.1205240Z test daemon::tests::launch_ladder_order_is_wmi_schtasks_breakaway_injob ... ok
2026-07-31T06:00:33.1206889Z test daemon::tests::net_retry_backoff_doubles_then_caps ... ok
2026-07-31T06:00:33.1208495Z test daemon::tests::null_std_handles_only_on_a_pipe_stderr ... ok
2026-07-31T06:00:33.1407696Z test config::tests::upsert_startup_endpoint_appends_then_replaces_preserving_other_knobs ... ok
2026-07-31T06:00:33.1410523Z test daemon::tests::the_refusal_line_names_the_remedy ... ok
2026-07-31T06:00:33.1411087Z test daemon::tests::windows_arg_quoting_roundtrips_the_rules ... ok
2026-07-31T06:00:33.1413223Z test daemon::tests::wmi_create_script_carries_the_no_window_startup_spec ... ok
2026-07-31T06:00:33.1414874Z test deadline::tests::advance_after_fire_steps_one_grid_normally_and_collapses_a_stall ... ok
2026-07-31T06:00:33.1488979Z test daemon::tests::implicit_ensure_declines_without_clearing_the_inhibit ... ok
2026-07-31T06:00:33.2052086Z test daemon::tests::breakaway_spawn_escapes_a_kill_on_close_job ... ok
2026-07-31T06:00:33.2238165Z test brainproc::tests::stale_generation_minus_one_ready_never_promotes ... ok
2026-07-31T06:00:33.2249949Z test deadline::tests::next_fire_between_grid_points_rounds_up ... ok
2026-07-31T06:00:33.2266948Z test deadline::tests::next_fire_long_jump_collapses_missed_ticks_to_one ... ok
2026-07-31T06:00:33.2268040Z test deadline::tests::next_fire_on_grid_returns_now_and_advances_strictly ... ok
2026-07-31T06:00:33.2268917Z test deadline::tests::next_fire_saturates_when_now_precedes_anchor ... ok
2026-07-31T06:00:33.2269430Z test deadline::tests::one_shot_fires_at_or_after_target_and_never_resets ... ok
2026-07-31T06:00:33.2571918Z test brainproc::tests::supervisor_owns_generation_and_stamps_start_reason ... ok
2026-07-31T06:00:33.2573346Z test brainproc::tests::supervisor_respawns_brain_until_stopped ... ok
2026-07-31T06:00:33.2574943Z test deadline::tests::zero_interval_degrades_to_config_default ... ok
2026-07-31T06:00:33.2581293Z test deelevate::tests::env_overlay_keeps_explicit_spt_home_alive ... ok
2026-07-31T06:00:33.2582425Z test deelevate::tests::plan_spawn_deelevates_only_with_a_target ... ok
2026-07-31T06:00:33.2584211Z test digest::tests::common_prefix_len_finds_the_unchanged_head ... ok
2026-07-31T06:00:33.3606820Z test crc_swap::tests::mapped_old_does_not_brick_apply_displaces_aside ... ok
2026-07-31T06:00:33.3611173Z test daemon::tests::a_captured_spawn_inherits_only_the_handle_in_its_allowlist ... ok
2026-07-31T06:00:33.3612799Z test digest::tests::merge_by_ts_interleaves_context ... ok
2026-07-31T06:00:33.4076553Z test brainproc::tests::trial_kills_alive_never_ready_candidate_before_rollback ... ok
2026-07-31T06:00:33.4543252Z test daemon::tests::a_scrubbed_variable_never_reaches_the_child ... ok
2026-07-31T06:00:33.4543759Z test digest::tests::resolve_config_precedence ... ok
2026-07-31T06:00:33.4545634Z test digest::tests::supersede_collapses_cross_generation_replay_to_newest ... ok
2026-07-31T06:00:33.4549833Z test digest::tests::supersede_is_noop_on_disjoint_sessions ... ok
2026-07-31T06:00:33.4550444Z test daemon::tests::spawn_env_additions_reach_the_child_and_keep_the_inherited_environment ... ok
2026-07-31T06:00:33.4551026Z test digest::tests::supersede_keeps_within_generation_repeats ... ok
2026-07-31T06:00:33.4553908Z test digest::tests::supersede_trims_divider_around_emptied_middle_generation ... ok
2026-07-31T06:00:33.4556470Z test digesthub::tests::dropped_subscriber_is_pruned ... ok
2026-07-31T06:00:33.4558546Z test digesthub::tests::project_and_publish_stores_latest ... ok
2026-07-31T06:00:33.4559015Z test digesthub::tests::publish_delta_is_tail_then_full_refresh ... ok
2026-07-31T06:00:33.4559507Z test digesthub::tests::subscribe_returns_current_base ... ok
2026-07-31T06:00:33.4560381Z test digesthub::tests::render_is_glanceable ... ok
2026-07-31T06:00:33.4561292Z test dispatch::tests::breaker_trips_with_doubling_capped_window_and_resets_on_progress ... ok
2026-07-31T06:00:33.4563013Z test dispatch::tests::classify_failure_seat_blocked_is_exactly_the_three_discipline_strings ... ok
2026-07-31T06:00:33.4563684Z test dispatch::tests::classifies_every_family_by_first_line_shape ... ok
2026-07-31T06:00:33.4565143Z test dispatch::tests::cold_enumeration_claims_at_most_the_pool_bound_per_poll ... ok
2026-07-31T06:00:33.4567042Z test dispatch::tests::digest_pull_and_rest_never_read_as_each_other ... ok
2026-07-31T06:00:33.4567765Z test dispatch::tests::dispatch_event_carries_the_complete_key_set ... ok
2026-07-31T06:00:33.4569244Z test dispatch::tests::feed_accumulator_commits_per_bound_never_per_chunk ... ok
2026-07-31T06:00:33.4569824Z test dispatch::tests::finished_is_terminal_for_attach_only ... ok
2026-07-31T06:00:33.4572128Z test dispatch::tests::line_endpoint_resolves_each_family_identity_key ... ok
2026-07-31T06:00:33.4572703Z test dispatch::tests::oneway_seatblocked_strikes_out_terminal_while_request_reply_paces_forever ... ok
2026-07-31T06:00:33.4573749Z test dispatch::tests::only_the_old_broker_unknown_verb_answer_falls_back_to_the_peek ... ok
2026-07-31T06:00:33.4574353Z test dispatch::tests::seat_blocked_requeues_budget_free_paced_by_the_breaker_window ... ok
2026-07-31T06:00:33.4575729Z test dispatch::tests::transient_failure_requeues_bounded_and_terminal_never_reenters ... ok
2026-07-31T06:00:33.4576285Z test dispatch::tests::unknown_shapes_refuse_classification ... ok
2026-07-31T06:00:33.4577173Z test docshost::tests::content_types_cover_the_bundle_classes ... ok
2026-07-31T06:00:33.4577543Z test docshost::tests::port_resolution_env_config_default ... ok
2026-07-31T06:00:33.4578850Z test docshost::tests::sanitizer_admits_pages_and_rejects_escapes ... ok
2026-07-31T06:00:33.4581095Z test drivehub::tests::a_following_op_is_served_when_nothing_refused ... ok
2026-07-31T06:00:33.4582788Z test drivehub::tests::activity_and_drive_never_clobber_each_other ... ok
2026-07-31T06:00:33.4584134Z test drivehub::tests::activity_take_is_latest_wins_and_exactly_once ... ok
2026-07-31T06:00:33.4586861Z test drivehub::tests::an_unknown_op_hangs_up_instead_of_being_swallowed ... ok
2026-07-31T06:00:33.4587476Z test drivehub::tests::a_foreign_owlery_is_refused_pre_ack_under_its_own_name ... ok
2026-07-31T06:00:33.4588792Z test drivehub::tests::clear_evicts_both_classes ... ok
2026-07-31T06:00:33.4589314Z test drivehub::tests::clear_evicts_the_slot ... ok
2026-07-31T06:00:33.4591165Z test drivehub::tests::dead_generation_activity_frame_is_never_served ... ok
2026-07-31T06:00:33.4591662Z test drivehub::tests::dead_generation_frame_is_never_served ... ok
2026-07-31T06:00:33.4593034Z test drivehub::tests::drive_result_activity_key_is_additive_on_the_wire ... ok
2026-07-31T06:00:33.4593563Z test drivehub::tests::only_a_pre_ack_refusal_permits_a_second_spawn ... ok
2026-07-31T06:00:33.4594429Z test drivehub::tests::slots_are_per_owner ... ok
2026-07-31T06:00:33.4594718Z test drivehub::tests::take_is_exactly_once ... ok
2026-07-31T06:00:33.4596309Z test drivehub::tests::the_launch_reply_shapes_round_trip ... ok
2026-07-31T06:00:33.4597692Z test drivehub::tests::write_is_latest_wins ... ok
2026-07-31T06:00:33.4838307Z test effect::tests::applied_set_survives_reopen ... ok
2026-07-31T06:00:33.4853649Z test effect::tests::apply_once_does_not_hold_the_journal_lock_across_effect ... ok
2026-07-31T06:00:33.5516941Z test effect::tests::each_named_minter_namespaces_its_ops ... ok
2026-07-31T06:00:33.5752916Z test effect::tests::failed_effect_is_not_recorded_applied ... ok
2026-07-31T06:00:33.8162829Z test effect::tests::gauntlet_is_exactly_once_across_brain_crashes ... ok
2026-07-31T06:00:34.1812376Z test effect::tests::marker_is_single_source_and_frozen ... ok
2026-07-31T06:00:34.1814220Z test drivehub::tests::the_pre_ack_causes_are_three_distinct_diagnostics ... ok
2026-07-31T06:00:34.1814784Z test effect::tests::minter_tag_round_trips ... ok
2026-07-31T06:00:34.1815116Z test effect::tests::open_creates_missing_parent_dirs ... ok
2026-07-31T06:00:34.2342961Z test daemon::tests::detached_no_inherit_falls_back_under_a_breakaway_denying_job ... ok
2026-07-31T06:00:34.2635217Z test daemon::tests::a_tree_teardown_reaches_a_grandchild_the_service_spawned ... ok
2026-07-31T06:00:34.5705665Z test effect::tests::recover_is_migration_free ... ok
2026-07-31T06:00:34.5706696Z test effect::tests::second_apply_for_same_key_is_deduped ... ok
2026-07-31T06:00:34.5721129Z test effect::tests::with_tracing_retry_no_retry_on_success ... ok
2026-07-31T06:00:34.5722051Z test effect::tests::with_tracing_retry_passes_through_other_errors ... ok
2026-07-31T06:00:34.5724089Z test effect::tests::with_tracing_retry_retries_once_on_no_longer_held ... ok
2026-07-31T06:00:34.5726696Z test effect::tests::with_tracing_retry_terminal_is_public_language ... ok
2026-07-31T06:00:34.5727307Z test brainproc::tests::trial_rolls_back_after_budget_of_pre_ready_exits ... ok
2026-07-31T06:00:34.5730534Z test frame::tests::envelope_with_unknown_trailing_field_decodes_on_older_peer ... ok
2026-07-31T06:00:34.5731124Z test frame::tests::handshake_accepts_newer_brain_on_older_broker ... ok
2026-07-31T06:00:34.5736256Z test frame::tests::handshake_rejects_below_floor ... ok
2026-07-31T06:00:34.5736726Z test frame::tests::handshake_rejects_role_mismatch ... ok
2026-07-31T06:00:34.5737049Z test frame::tests::unknown_kind_is_not_a_decode_error ... ok
2026-07-31T06:00:34.5737336Z test grants::tests::escalation_answers_apply ... ok
2026-07-31T06:00:34.5754241Z test grants::tests::escalation_ask_body_roundtrip ... ok
2026-07-31T06:00:34.5757361Z test grants::tests::no_session_escalates_with_none_target ... ok
2026-07-31T06:00:34.5761019Z test grants::tests::preconsent_flags_author_grants ... ok
2026-07-31T06:00:34.5761812Z test grants::tests::reserved_capabilities_refuse_even_when_granted ... ok
2026-07-31T06:00:34.5767032Z test grants::tests::ungranted_escalates_granted_allows ... ok
2026-07-31T06:00:34.5777804Z test harnesshost::tests::mint_session_id_is_fresh_hex ... ok
2026-07-31T06:00:34.5780238Z test harnesshost::tests::node_key_fills_advertised_label_in_session_template ... ok
2026-07-31T06:00:34.5788337Z test harnesshost::tests::node_missing_reference_fails_loud ... ok
2026-07-31T06:00:34.5800080Z test harnesshost::tests::prepare_fails_closed_on_wrong_kind_missing_role_and_bad_template ... ok
2026-07-31T06:00:34.6019995Z test harnesshost::tests::prepare_fills_env_inject_values_with_substitution ... ok
2026-07-31T06:00:34.6039380Z test harnesshost::tests::prepare_fills_id_and_session_into_self_command ... ok
2026-07-31T06:00:34.6111377Z test harnesshost::tests::prepare_resume_falls_back_to_self_when_no_resume_role ... ok
2026-07-31T06:00:34.6146880Z test harnesshost::tests::prepare_selects_resume_template_on_resume_else_self ... ok
2026-07-31T06:00:34.6230737Z test harnesshost::tests::prepare_threads_translation_binary_when_declared ... ok
2026-07-31T06:00:34.6327327Z test harnesshost::tests::provisional_session_id_recognizes_own_mint_only ... ok
2026-07-31T06:00:34.6602983Z test harnesshost::tests::translation_binary_resolves_against_install_dir ... ok
2026-07-31T06:00:34.7189846Z test broker::tests::viewer_writer_emits_evicted_marker_only_on_an_evicted_close ... ok
2026-07-31T06:00:34.7383400Z test effect::tests::poisoned_journal_lock_still_applies_subsequent_ops ... ok
2026-07-31T06:00:34.7401235Z test effect::tests::shellchan_and_rc_same_session_dont_collide ... ok
2026-07-31T06:00:34.7441056Z test effect::tests::ptywrite_skips_the_durable_journal_write_while_netsend_persists ... ok
2026-07-31T06:00:39.6732751Z test daemon::tests::is_running_tracks_the_seed_channel ... ok
2026-07-31T06:00:40.8388344Z test deadline::tests::cold_and_crash_write_fresh_anchor_at_now ... ok
2026-07-31T06:00:40.8611129Z test deadline::tests::corrupt_file_degrades_to_fresh ... ok
2026-07-31T06:00:40.8612085Z test deadline::tests::distinct_keys_do_not_cross_clobber ... ok
2026-07-31T06:00:40.8639170Z test lifecycle::tests::event_turn_timeout_floors_at_thirty_seconds ... ok
2026-07-31T06:00:40.8644571Z test lifecycle::tests::first_turn_psyche_context_is_never_empty ... ok
2026-07-31T06:00:40.8666428Z test deadline::tests::update_keeps_anchor_and_refreshes_interval ... ok
2026-07-31T06:00:40.8818309Z test deadline::tests::update_with_no_file_falls_back_fresh ... ok
2026-07-31T06:00:40.8847121Z test lifecycle::tests::is_owlery_internal_cases ... ok
2026-07-31T06:00:43.9022391Z test digest::tests::extractor_spans_sessions_with_a_boundary_marker ... ok
2026-07-31T06:00:43.9177866Z test digest::tests::log_less_two_origin_merge_interleaves_by_ts ... ok
2026-07-31T06:00:43.9364908Z test digest::tests::projects_a_log_less_endpoint_from_digest_log ... ok
2026-07-31T06:00:43.9372330Z test digest::tests::projects_empty_for_a_sourceless_endpoint ... ok
2026-07-31T06:00:43.9374369Z test lifecycle::tests::psyche_turn_keys_carry_custody_sids_and_context_file_path ... ok
2026-07-31T06:00:43.9375661Z test lifecycle::tests::psyche_turn_strikes_exhausted_boundary ... ok
2026-07-31T06:00:43.9438162Z test lifecycle::tests::psyche_context_file_continue_is_zero_bytes_fresh_is_nonempty ... ok
2026-07-31T06:00:44.1131208Z test grants::tests::escalation_notif_fires_to_most_recent_and_roundtrips ... ok
2026-07-31T06:00:44.2971446Z test inject::tests::has_parked_idle_spool_gates_on_idle_hosted_and_pending ... ok
2026-07-31T06:00:44.4818182Z test inject::tests::shared_inject_leg_detects_spt_hosted ... ok
2026-07-31T06:00:44.5106922Z test lifecycle::tests::base_keys_carries_single_subnet_no_home ... ok
2026-07-31T06:00:46.2160260Z test lifecycle::tests::crash_signoff_spares_recovered_self ... ok
2026-07-31T06:00:47.0915192Z test lifecycle::tests::crash_signoff_tears_down_when_still_gone ... ok
2026-07-31T06:00:47.1751920Z test lifecycle::tests::custody_survives_parent_boundary_and_reseed_clears ... ok
2026-07-31T06:00:47.8883624Z test lifecycle::tests::echo_fire_resolves_relative_commune_dir_against_endpoint_cwd ... ok
2026-07-31T06:00:47.8982581Z test lifecycle::tests::echo_fire_skips_loud_on_relative_dir_without_cwd ... ok
2026-07-31T06:00:47.9303007Z test lifecycle::tests::harness_owner_gone_anchors_on_parent_pid ... ok
2026-07-31T06:00:47.9304820Z test lifecycle::tests::resolve_endpoint_drop_dir_cases ... ok
2026-07-31T06:00:47.9329490Z test lifecycle::tests::manifest_cell_refresh_swaps_manifest_and_runtime ... ok
2026-07-31T06:00:47.9341521Z test lifecycle::tests::node_key_fills_advertised_label_in_lifecycle_base_keys ... ok
2026-07-31T06:00:48.4020727Z test lifecycle::tests::orphan_watch_fires_on_dead_owner ... ok
2026-07-31T06:00:48.4022432Z test lifecycle::tests::session_not_found_discriminates_reseed_from_strike ... ok
2026-07-31T06:00:48.4151655Z test lifecycle::tests::orphan_watch_honors_stop_for_live_owner ... ok
2026-07-31T06:00:49.0603308Z test lifecycle::tests::psyche_turn_threads_parent_read_env_into_spawn ... ok
2026-07-31T06:00:49.0934634Z test lifecycle::tests::pulse_loop_does_not_write_anchor_per_fire ... ok
2026-07-31T06:00:49.1257210Z test lifecycle::tests::pulse_loop_is_config_paced_and_killable ... ok
2026-07-31T06:00:49.1264183Z test linkhost::tests::per_capability_act_gate_blocks_until_class_scoped_grant ... ok
2026-07-31T06:00:49.1842850Z test lifecycle::tests::pulse_loop_update_preserves_phase_crash_rebases ... ok
2026-07-31T06:00:49.2360540Z test lifecycle::tests::pulse_recency_and_auto_suspend_follow_resting_state ... ok
2026-07-31T06:01:03.7953793Z test lifecycle::tests::pulse_tick_ingests_drop ... ok
2026-07-31T06:01:21.4873779Z test lifecycle::tests::relative_commune_dir_resolves_against_endpoint_cwd_and_fills_project_branch ... ok
2026-07-31T06:01:21.5011881Z test lifecycle::tests::reload_fires_on_disk_change ... ok
2026-07-31T06:01:21.5167353Z test lifecycle::tests::reload_keeps_last_good_on_unparseable ... ok
2026-07-31T06:01:21.5238485Z test lifecycle::tests::reload_noop_when_unchanged ... ok
2026-07-31T06:01:21.5250553Z test lifecycle::tests::reload_noop_without_install_dir ... ok
2026-07-31T06:01:21.5252346Z test livehost::tests::decide_resume_goal_table ... ok
2026-07-31T06:01:21.7439527Z test lifecycle::tests::rest_edge_echo_success_clears_stale_psyche_stamp ... ok
2026-07-31T06:01:21.7440893Z test livehost::tests::hybrid_self_heal_due_table ... ok
2026-07-31T06:01:21.7656566Z test livehost::tests::legacy_psyche_sweep_guard_is_id_specific_and_fail_safe ... ok
2026-07-31T06:01:21.7836362Z test livehost::tests::live_bin_gc_removes_own_copy_and_displaces_when_locked ... ok
2026-07-31T06:01:21.9568246Z test lifecycle::tests::rest_event_fires_echo_once_and_wake_resurfaces ... ok
2026-07-31T06:01:22.3830180Z test lifecycle::tests::role_less_manifest_ticks_strike_free ... ok
2026-07-31T06:01:22.4673316Z test lifecycle::tests::thrash_budget_trips_on_a_synthetic_failure_loop_without_touching_status ... ok
2026-07-31T06:01:22.4977678Z test lifecycle::tests::turn_budget_stamps_on_exhaustion_and_clears_on_success ... ok
2026-07-31T06:01:22.6387682Z test linkhost::tests::cmd_wakes_a_stale_online_persistent_instance ... ok
2026-07-31T06:01:22.9938521Z test linkhost::tests::gateway_typed_owner_resolves_and_drives_keyed_on_id_not_type ... ok
2026-07-31T06:01:23.1897746Z test linkhost::tests::prepare_drive_is_live_or_drop_and_never_spools ... ok
2026-07-31T06:01:23.5215926Z test linkhost::tests::relink_refuses_a_live_instance_but_recovers_a_stale_online_one ... ok
2026-07-31T06:01:23.5991105Z test linkhost::tests::run_action_drive_drops_offline_without_wake_or_spool ... ok
2026-07-31T06:01:23.9407095Z test linkhost::tests::run_action_refuses_gated_op_without_spooling ... ok
2026-07-31T06:01:24.5387689Z test linkhost::tests::run_action_relinks_drives_and_refuses ... ok
2026-07-31T06:01:24.6861977Z test livehost::tests::boot_gate_offlines_sessionless_controllable_then_reconcile_skips_host ... ok
2026-07-31T06:01:24.6863709Z test livehost::tests::reconcile_routing_controllable_falls_through_to_broker_session_truth ... ok
2026-07-31T06:01:25.4429857Z test livehost::tests::broker_failure_skips_the_pass_never_mass_offlines ... ok
2026-07-31T06:01:25.5391057Z test livehost::tests::control_reap_clears_sticky_controlled_on_already_offline_perch ... ok
2026-07-31T06:01:25.5967642Z test livehost::tests::fresh_brain_rehydrates_an_online_live_endpoint ... ok
2026-07-31T06:01:25.5969418Z test livehost::tests::restart_resume_gate_reruns_the_orphaned_controllable_dead_set_regardless_of_state ... ok
2026-07-31T06:01:25.7030012Z test livehost::tests::pull_liveness_demotes_a_relay_held_endpoint_instead_of_offlining_it ... ok
2026-07-31T06:01:25.7031622Z test machineid::tests::hash_is_domain_separated_and_stable ... ok
2026-07-31T06:01:25.9623630Z test livehost::tests::pull_liveness_marks_sessionless_spt_hosted_offline_only ... ok
2026-07-31T06:01:25.9624739Z test msg::tests::bytes_round_trip_through_payload ... ok
2026-07-31T06:01:25.9626705Z test msg::tests::endpoint_injected_envelope_carries_delivered_and_spool_hint ... ok
2026-07-31T06:01:25.9628998Z test msg::tests::endpoint_input_frames_round_trip ... ok
2026-07-31T06:01:25.9631438Z test msg::tests::evicted_envelope_round_trips ... ok
2026-07-31T06:01:25.9633477Z test msg::tests::input_req_absent_ack_defaults_true_n_minus_1_safe ... ok
2026-07-31T06:01:25.9634999Z test msg::tests::input_req_ack_false_round_trips_faithfully ... ok
2026-07-31T06:01:25.9637766Z test msg::tests::net_frames_round_trip_and_tolerate_unknown_fields ... ok
2026-07-31T06:01:25.9639203Z test msg::tests::output_envelope_round_trips ... ok
2026-07-31T06:01:25.9640832Z test msg::tests::output_sync_flag_defaults_absent_and_skips_when_false ... ok
2026-07-31T06:01:25.9642754Z test msg::tests::presence_event_round_trips_and_tolerates_future_kind ... ok
2026-07-31T06:01:25.9644160Z test msg::tests::spawn_req_tolerates_unknown_field ... ok
2026-07-31T06:01:25.9646033Z test msg::tests::stream_lifetime_is_additive_and_defaults_durable ... ok
2026-07-31T06:01:25.9647729Z test msg::tests::two_phase_join_wire_round_trips ... ok
2026-07-31T06:01:25.9649301Z test msg::tests::wire_decodes_old_shape_to_legacy ... ok
2026-07-31T06:01:25.9708386Z test nethost::tests::append_halts_at_first_failed_write_removes_the_seat_and_cancels_the_lease ... ok
2026-07-31T06:01:25.9714499Z test nethost::tests::attach_replay_never_interleaves_with_concurrent_live_appends ... ok
2026-07-31T06:01:25.9720928Z test nethost::tests::begin_attach_refuses_only_while_a_poisoned_prior_still_drains ... ok
2026-07-31T06:01:26.1268394Z test livehost::tests::pull_reconcile_offlines_perch_when_broker_session_dies ... ok
2026-07-31T06:01:26.1667320Z test nethost::tests::bounded_block_on_cuts_a_never_completing_op_with_an_ordinary_error ... ok
2026-07-31T06:01:26.1794110Z test livehost::tests::reconcile_attempts_resume_for_a_registered_woken_endpoint ... ok
2026-07-31T06:01:26.1859544Z test nethost::tests::displaced_writer_failure_never_cancels_the_successor_lease ... ok
2026-07-31T06:01:26.1870342Z test nethost::tests::dispatch_stream_infos_excludes_local_and_retired_rows_server_side ... ok
2026-07-31T06:01:26.1914724Z test nethost::tests::finish_halts_and_removes_a_poisoned_seat ... ok
2026-07-31T06:01:26.2180974Z test nethost::tests::host_binds_endpoint_to_node_identity ... ok
2026-07-31T06:01:26.2228274Z test nethost::tests::loopback_conn_is_a_reused_singleton_that_cross_wires_a_stream_pair ... ok
2026-07-31T06:01:26.2229714Z test nethost::tests::next_seq_counts_appends_not_logical_chunks ... ok
2026-07-31T06:01:26.2482834Z test nethost::tests::op_maps_are_minter_namespaced ... ok
2026-07-31T06:01:26.2786431Z test nethost::tests::open_class_routes_to_the_opener_row_only ... ok
2026-07-31T06:01:26.2790205Z test nethost::tests::opener_capture_gives_up_bounded_on_a_newline_less_stream ... ok
2026-07-31T06:01:26.2791822Z test nethost::tests::opener_pins_first_line_across_full_ring_roll ... ok
2026-07-31T06:01:26.2862682Z test nethost::tests::overflow_detaches_without_lease_cancel_and_the_brain_resumes_from_cursor ... ok
2026-07-31T06:01:26.2926625Z test nethost::tests::presence_log_mirrors_the_seat_discipline ... ok
2026-07-31T06:01:26.2928317Z test nethost::tests::retentive_log_is_lossless_ordered_while_ordinary_log_overwrites ... ok
2026-07-31T06:01:26.3310165Z test nethost::tests::retire_hides_the_row_while_active_rows_stay ... ok
2026-07-31T06:01:26.3422237Z test nethost::tests::conn_close_sweeps_its_stream_rows ... ok
2026-07-31T06:01:26.3623866Z test nethost::tests::retire_sweep_dismisses_the_seat_and_terminal_retire_drops_the_row ... ok
2026-07-31T06:01:26.3788830Z test nethost::tests::retired_row_still_flushes_a_late_reply ... ok
2026-07-31T06:01:26.3862491Z test nethost::tests::send_stream_refuses_on_a_canceled_lease ... ok
2026-07-31T06:01:26.4171150Z test nethost::tests::unsubscribe_releases_only_the_callers_seat_joins_writer_and_is_idempotent ... ok
2026-07-31T06:01:26.4429356Z test livehost::tests::reconcile_converges_a_dead_relay_and_spares_a_live_or_unproven_one ... ok
2026-07-31T06:01:26.4588719Z test nethost::tests::two_hosts_dial_over_loopback ... ok
2026-07-31T06:01:26.4934358Z test livehost::tests::reconcile_does_not_double_host ... ok
2026-07-31T06:01:26.5711906Z test livehost::tests::reconcile_hosts_an_online_live_endpoint_and_drives_its_pulse ... ok
2026-07-31T06:01:26.6177694Z test livehost::tests::reconcile_keeps_driver_on_transient_read_fail_unhosts_on_dir_gone ... ok
2026-07-31T06:01:26.6675551Z test livehost::tests::reconcile_leaves_a_genuinely_suspended_endpoint_alone ... ok
2026-07-31T06:01:26.7593403Z test livehost::tests::reconcile_marks_unbound_skeleton_offline_on_session_death ... ok
2026-07-31T06:01:26.9335733Z test livehost::tests::reconcile_reaps_orphaned_worker_and_spares_live_parent ... ok
2026-07-31T06:01:26.9744646Z test livehost::tests::reconcile_refuses_a_woken_endpoint_with_an_unregistered_adapter ... ok
2026-07-31T06:01:26.9960480Z test livehost::tests::reconcile_skips_a_woken_endpoint_with_no_ledger_row ... ok
2026-07-31T06:01:27.0283293Z test livehost::tests::reconcile_skips_an_offline_live_endpoint ... ok
2026-07-31T06:01:27.0496541Z test notif::tests::notif_command_renders_all_keys_and_is_opt_in ... ok
2026-07-31T06:01:27.0756955Z test livehost::tests::reconcile_unhosts_on_offline_transition ... ok
2026-07-31T06:01:27.1689697Z test livehost::tests::split_cleanup_clears_all_three_stamps_on_state_quirk_rows ... ok
2026-07-31T06:01:27.1694572Z test machineid::tests::machine_id_hash_resolves_and_is_stable ... ok
2026-07-31T06:01:27.1696258Z test notifgate::tests::an_unvalidatable_notify_passes ... ok
2026-07-31T06:01:27.1698445Z test notifgate::tests::distinct_notifs_both_deliver ... ok
2026-07-31T06:01:27.2446812Z test notifgate::tests::retain_preserves_order_of_the_survivors ... ok
2026-07-31T06:01:27.2448950Z test notifgate::tests::the_validity_gate_decision_table ... ok
2026-07-31T06:01:27.3100405Z test nethost::tests::loopback_tunnel_backpressures_without_loss ... ok
2026-07-31T06:01:27.4587380Z test notifsync::tests::concurrent_dismiss_and_surface_commute_across_the_feed ... ok
2026-07-31T06:01:27.4653136Z test notif::tests::consent_decision_produces_notif_only_when_gated ... ok
2026-07-31T06:01:27.5330373Z test notifsync::tests::feed_converges_two_stores_and_dismiss_replicates ... ok
2026-07-31T06:01:27.6555529Z test notifsync::tests::non_member_subnet_record_never_materializes ... ok
2026-07-31T06:01:27.6556077Z test notifsync::tests::node_scoped_rows_are_excluded_from_the_feed ... ok
2026-07-31T06:01:27.6558246Z test pairhost::tests::a_re_postured_subnet_advises_and_never_applies ... ok
2026-07-31T06:01:27.6567269Z test pairhost::tests::joiner_clock_render_shows_step_offset_and_state ... ok
2026-07-31T06:01:27.6573768Z test pairhost::tests::meet_failure_detail_concise_vs_verbose ... ok
2026-07-31T06:01:27.6584313Z test pairhost::tests::meet_final_retry_failing_surrenders_once ... ok
2026-07-31T06:01:27.6585340Z test pairhost::tests::meet_retries_once_after_refresh_on_exhaustion ... ok
2026-07-31T06:01:27.6585901Z test pairhost::tests::the_advisory_says_nothing_was_applied ... ok
2026-07-31T06:01:27.6587102Z test pairhost::tests::wire_errors_classify_for_the_guided_ux ... ok
2026-07-31T06:01:27.7068292Z test presence::tests::mra_degrades_to_local_and_skips_noise_rows ... ok
2026-07-31T06:01:27.7235993Z test notifsync::tests::untrusted_and_cross_subnet_origins_are_dropped ... ok
2026-07-31T06:01:27.7282968Z test notif::tests::expired_row_is_auto_dismissed_at_boundary_not_surfaced ... ok
2026-07-31T06:01:27.7434133Z test presence::tests::snapshot_loading_degrades_on_junk ... ok
2026-07-31T06:01:27.7555445Z test presence::tests::mra_joins_local_and_gossiped_legs_under_one_max ... ok
2026-07-31T06:01:27.7877313Z test projwriter::tests::cold_construct_spawns_no_git_and_first_cycle_publishes ... ok
2026-07-31T06:01:27.8070736Z test presence::tests::subnet_scope_gates_both_legs ... ok
2026-07-31T06:01:27.8226372Z test projwriter::tests::corrupt_index_is_repaired_and_counted ... ok
2026-07-31T06:01:27.9202314Z test notif::tests::first_fire_declines_an_already_expired_row ... ok
2026-07-31T06:01:28.1439680Z test notif::tests::first_fire_reaches_most_recent_visible_endpoint ... ok
2026-07-31T06:01:28.3581497Z test notif::tests::first_fire_redirects_to_a_fresher_remote_winner_unmarked ... ok
2026-07-31T06:01:28.5265577Z test notif::tests::first_fire_rides_the_quiet_window_not_the_live_stream ... ok
2026-07-31T06:01:28.6821404Z test notif::tests::hidden_endpoint_boundary_surfaces_nothing ... ok
2026-07-31T06:01:28.7447061Z test projwriter::tests::cwd_invalidation_evicts_shared_cache_entry ... ok
2026-07-31T06:01:28.7449080Z test propagate::tests::classifier_maps_every_status_shape ... ok
2026-07-31T06:01:28.8809347Z test notif::tests::hidden_endpoint_is_never_the_target ... ok
2026-07-31T06:01:28.9633896Z test notif::tests::no_live_endpoint_is_a_typed_no_target ... ok
2026-07-31T06:01:29.1586635Z test notif::tests::node_scoped_first_fire_ignores_a_fresher_remote_winner ... ok
2026-07-31T06:01:31.0433578Z test notif::tests::resurface_delivers_undismissed_with_gates ... ok
2026-07-31T06:01:31.3019382Z test notif::tests::rollback_notif_is_loud_and_resurfaces ... ok
2026-07-31T06:01:33.2306647Z test notif::tests::shell_notif_templates_render_for_attached_instances_only ... ok
2026-07-31T06:01:33.4876458Z test notif::tests::suppression_window_holds_cross_endpoint ... ok
2026-07-31T06:01:33.5444777Z test pairhost::tests::an_advisory_records_the_sighting_and_still_applies_nothing ... ok
2026-07-31T06:01:33.5446542Z test pump::health::tests::degraded_on_all_peer_failure_healthy_only_on_real_progress ... ok
2026-07-31T06:01:33.5562586Z test pump::health::tests::health_file_roundtrip_and_degrade ... ok
2026-07-31T06:01:33.5589198Z test pump::health::tests::registry_admit_stamp_survives_restart_rounds_and_never_regresses ... ok
2026-07-31T06:01:33.5590615Z test pump::health::tests::stage_parses_from_attributed_reasons ... ok
2026-07-31T06:01:34.2198514Z test projwriter::tests::ordinary_commit_is_noop_config_change_rederives ... ok
2026-07-31T06:01:36.8198670Z test projwriter::tests::writer_thread_debounces_burst_into_one_cycle ... ok
2026-07-31T06:01:37.2096269Z test psyrelay::tests::empty_and_oversize_bodies_drop_typed ... ok
2026-07-31T06:01:37.2929307Z test pump::registry::tests::fire_due_rotations_rotates_due_and_leaves_pending ... ok
2026-07-31T06:01:37.2938001Z test pump::registry::tests::poll_wake_takes_the_advertise_marker_exactly_once ... ok
2026-07-31T06:01:37.5128674Z test projwriter::tests::failed_cycle_preserves_last_known_good ... ok
2026-07-31T06:01:37.5136705Z test pump::tests::choreography_fan_targets_skips_detached_and_self ... ok
2026-07-31T06:01:37.5137969Z test pump::tests::choreography_first_tick_primes_all_legs ... ok
2026-07-31T06:01:37.5139331Z test pump::tests::choreography_mark_after_round_stamps_only_due ... ok
2026-07-31T06:01:37.5140969Z test pump::tests::choreography_peer_step_aborts_on_first_failure ... ok
2026-07-31T06:01:37.5143387Z test pump::tests::choreography_pre_round_once_and_before_any_peer_step ... ok
2026-07-31T06:01:37.5144702Z test pump::tests::choreography_wake_forces_only_that_worker ... ok
2026-07-31T06:01:37.5146535Z test pump::tests::drain_read_classifies_dead_carrier_as_restart_timeout_as_quiet ... ok
2026-07-31T06:01:37.5148365Z test pump::tests::first_tick_is_due_and_never_underflows ... ok
2026-07-31T06:01:37.5449714Z test pump::tests::heartbeat_writes_and_advances ... ok
2026-07-31T06:01:37.5451505Z test pump::tests::peer_leg_outcome_isolates_ordinary_backs_off_carrier_timeout_still_poisons ... ok
2026-07-31T06:01:37.5453177Z test pump::tests::per_peer_backoff_doubles_caps_and_eligibility ... ok
2026-07-31T06:01:37.5460624Z test pump::tests::presence_state_effect_correlates_and_isolates ... ok
2026-07-31T06:01:37.5575788Z test projwriter::tests::endpoint_events_patch_rows_and_drop_purged ... ok
2026-07-31T06:01:37.5577100Z test pump::tests::push_target_is_the_full_roster_minus_self_and_tombstoned ... ok
2026-07-31T06:01:37.5670636Z test pump::tests::resolve_submit_addr_walks_the_route_chain ... ok
2026-07-31T06:01:37.5783961Z test pump::tests::startup_reconcile_heals_suspect_rows_and_migrates_invalid_ones ... ok
2026-07-31T06:01:37.5786503Z test pump::tests::supervisor_backoff_doubles_caps_and_resets ... ok
2026-07-31T06:01:37.5817741Z test pump::tests::push_feed_retires_its_own_row_after_successful_fin ... ok
2026-07-31T06:01:37.5819038Z test pump::tests::wake_forces_a_round_regardless_of_cadence ... ok
2026-07-31T06:01:37.5821116Z test pump::update::tests::advertised_version_finds_dotted_tokens_and_refuses_counter_shapes ... ok
2026-07-31T06:01:37.5822475Z test pump::update::tests::the_retire_predicate_keeps_ahead_and_unparseable_rows ... ok
2026-07-31T06:01:37.5823973Z test pump::update::tests::version_ge_compares_dotted_versions_and_rejects_garbage ... ok
2026-07-31T06:01:37.6092497Z test pump::tests::supervisor_restarts_a_panicking_pump_until_stop ... ok
2026-07-31T06:01:37.6093861Z test reap::tests::reap_without_enroll_is_noop ... ok
2026-07-31T06:01:37.6095103Z test reconcile::tests::active_node_wins ... ok
2026-07-31T06:01:37.6096737Z test reconcile::tests::double_active_tiebreaks_deterministically ... ok
2026-07-31T06:01:37.6098489Z test reconcile::tests::fallback_lowest_non_offline ... ok
2026-07-31T06:01:37.6099824Z test reconcile::tests::no_rows_reconciles_locally ... ok
2026-07-31T06:01:37.6126167Z test psyrelay::tests::notify_reaches_own_user_only ... FAILED
2026-07-31T06:01:37.6414353Z test registryhost::tests::admitted_feeds_stamp_the_heard_map ... ok
2026-07-31T06:01:37.9315055Z test psyrelay::tests::notify_without_live_endpoint_is_pending ... ok
2026-07-31T06:01:37.9488366Z test projwriter::tests::warm_start_unchanged_generation_scans_nothing ... ok
2026-07-31T06:01:38.0795441Z test psyrelay::tests::null_stdout_driver_fails_the_guard ... ok
2026-07-31T06:01:38.3163409Z test psyrelay::tests::prose_only_relays_nothing ... ok
2026-07-31T06:01:38.5638837Z test psyrelay::tests::reply_relays_to_inbound_sender ... ok
2026-07-31T06:01:38.7929144Z test psyrelay::tests::reply_without_target_is_dropped ... ok
2026-07-31T06:01:38.8102733Z test registryhost::tests::apply_feed_batch_writes_snapshots_once_with_per_kind_semantics_parity ... ok
2026-07-31T06:01:38.8286645Z test registryhost::tests::apply_feed_flips_only_on_observed_transition_to_active ... ok
2026-07-31T06:01:38.8341412Z test registryhost::tests::apply_feed_gates_and_merges_under_the_lease ... ok
2026-07-31T06:01:38.8463295Z test registryhost::tests::apply_node_labels_gates_and_merges ... ok
2026-07-31T06:01:39.1103802Z test reap::tests::job_reaps_enrolled_child_and_grandchild ... ok
2026-07-31T06:01:39.1206586Z test registryhost::tests::evict_aged_offline_rows_reaps_ghosts_and_rewrites_snapshots ... ok
2026-07-31T06:01:39.1294415Z test registryhost::tests::evict_silent_peers_drops_unheard_rows_and_rewrites_snapshots ... ok
2026-07-31T06:01:39.2462430Z test psyrelay::tests::spoofed_routing_is_stripped_and_restamped ... ok
2026-07-31T06:01:39.2463640Z test registryhost::tests::gossip_controller_node_covers_any_controller ... ok
2026-07-31T06:01:39.2467592Z test registryhost::tests::recent_projects_cap_fires_on_output_length_not_scanned_rows ... ok
2026-07-31T06:01:39.2469985Z test registryhost::tests::recent_projects_derive_once_per_distinct_cwd ... ok
2026-07-31T06:01:39.2487630Z test pump::registry::tests::disclosable_lines_keeps_the_per_subnet_filter ... ok
2026-07-31T06:01:39.2698503Z test registryhost::tests::repair_evict_tombstones_roster_snapshot_and_notices ... ok
2026-07-31T06:01:39.2700005Z test registryhost::tests::superseded_requires_label_and_machine_id_under_other_key ... ok
2026-07-31T06:01:39.2755551Z test pump::registry::tests::disclosable_lines_pushes_the_engine_room_only_to_its_chosen_viewer ... ok
2026-07-31T06:01:39.2786833Z test pump::registry::tests::discover_gate_filters_the_advert_push_per_viewer ... ok
2026-07-31T06:01:39.2797499Z test registryhost::tests::with_epoch_is_the_one_canonical_counter ... ok
2026-07-31T06:01:39.3735107Z test pump::registry::tests::pre_round_sweeps_and_refreshes_adverts_each_round ... ok
2026-07-31T06:01:39.4280418Z test registryhost::tests::advertise_local_scans_and_respects_visibility ... ok
2026-07-31T06:01:39.4613166Z test relcache::tests::applied_state_two_phase_round_trips_and_degrades ... ok
2026-07-31T06:01:39.4749434Z test relcache::tests::docs_bundle_stages_loads_and_clears_independently ... ok
2026-07-31T06:01:39.4819496Z test registryhost::tests::advertise_local_stamps_the_node_label ... ok
2026-07-31T06:01:39.4936139Z test relcache::tests::partial_update_set_can_serve_held_platform_only ... ok
2026-07-31T06:01:39.5037881Z test relcache::tests::single_platform_stamp_is_explicit_and_cleared_on_restage ... ok
2026-07-31T06:01:39.5143646Z test relcache::tests::torn_or_corrupt_stage_offers_nothing ... ok
2026-07-31T06:01:39.5207829Z test relcache::tests::stage_round_trips_and_restage_replaces ... ok
2026-07-31T06:01:39.5208717Z test registryhost::tests::advertised_status_ignores_host_error ... ok
2026-07-31T06:01:39.5234927Z test relcache::tests::update_set_round_trips_and_loads_by_platform ... ok
2026-07-31T06:01:39.5321146Z test release::tests::builtin_keys_merge_and_revoke_under_file_overlay ... ok
2026-07-31T06:01:39.5323092Z test release::tests::current_platform_is_registered_or_unknown ... ok
2026-07-31T06:01:39.5323568Z test release::tests::channel_mismatch_is_rejected ... ok
2026-07-31T06:01:39.5326768Z test release::tests::artifact_digest_mismatch_is_rejected ... ok
2026-07-31T06:01:39.5328259Z test release::tests::hex_roundtrips ... ok
2026-07-31T06:01:39.5328678Z test release::tests::docs_entry_is_additive_and_verifies_exact_bytes ... ok
2026-07-31T06:01:39.5330764Z test release::tests::known_triples_project_the_registry ... ok
2026-07-31T06:01:39.5331162Z test release::tests::musl_platform_registered ... ok
2026-07-31T06:01:39.5443210Z test release::tests::expired_metadata_is_rejected ... ok
2026-07-31T06:01:39.5447873Z test release::tests::revoked_key_is_rejected ... ok
2026-07-31T06:01:39.5449936Z test release::tests::shipped_builtin_table_is_well_formed ... ok
2026-07-31T06:01:39.5491692Z test release::tests::production_policy_loads_fail_closed ... ok
2026-07-31T06:01:39.5544243Z test release::tests::tampered_metadata_fails_signature ... ok
2026-07-31T06:01:39.5593108Z test release::tests::untrusted_key_is_unknown ... ok
2026-07-31T06:01:39.5623527Z test release::tests::non_monotonic_version_is_rollback ... ok
2026-07-31T06:01:39.5635901Z test release::tests::update_set_artifact_mismatch_is_rejected ... ok
2026-07-31T06:01:39.5718471Z test release::tests::update_set_missing_platform_is_typed_rejection ... ok
2026-07-31T06:01:39.5729186Z test release::tests::update_set_tampering_breaks_whole_set_signature ... ok
2026-07-31T06:01:39.5782109Z test release::tests::update_set_channel_and_rollback_gates_hold ... ok
2026-07-31T06:01:39.5808414Z test release::tests::update_set_verifies_and_selects_platform_artifact ... ok
2026-07-31T06:01:39.5822691Z test release::tests::valid_release_verifies_and_artifact_matches ... ok
2026-07-31T06:01:39.6047202Z test release::tests::verify_detached_signs_raw_artifact_bytes ... ok
2026-07-31T06:01:39.6365642Z test registryhost::tests::advertised_status_splits_unbound_warm_from_cold_suspended ... ok
2026-07-31T06:01:39.6372984Z test resting::tests::apply_event_miss_message_is_single_sourced ... ok
2026-07-31T06:01:39.6410351Z test resting::tests::apply_event_echo_failure_is_loud_but_state_persists ... ok
2026-07-31T06:01:39.6777733Z test resting::tests::apply_event_fires_echo_once_per_rest_edge_and_wake_on_wake ... ok
2026-07-31T06:01:39.6778988Z test resting::tests::auto_suspend_counts_from_dormancy_onset_and_is_opt_in ... ok
2026-07-31T06:01:39.6845909Z test resting::tests::apply_event_no_spurious_echo_on_cold_void_suspend ... ok
2026-07-31T06:01:39.7120193Z test resting::tests::apply_event_wakes_a_cold_void_perch ... ok
2026-07-31T06:01:39.7121087Z test resting::tests::effective_rest_state_table ... ok
2026-07-31T06:01:39.7138488Z test resting::tests::freshness_pull_marker_is_taken_exactly_once ... ok
2026-07-31T06:01:39.7139889Z test resting::tests::knob_chain_resolves_global_node_endpoint ... ok
2026-07-31T06:01:39.7285221Z test resting::tests::apply_event_auto_suspends_under_the_resolved_chain ... ok
2026-07-31T06:01:39.7663029Z test registryhost::tests::advertisement_carries_both_authored_blurb ... ok
2026-07-31T06:01:39.7664911Z test resting::tests::route_rest_event_contract_table ... ok
2026-07-31T06:01:39.7779611Z test resting::tests::deferred_held_keys_on_the_durable_rest_record ... ok
2026-07-31T06:01:39.7780773Z test resting::tests::transition_table_matches_the_context_model ... ok
2026-07-31T06:01:39.7784292Z test rollback_compat::tests::pre_ready_durable_files_are_additive_and_n1_readable ... ok
2026-07-31T06:01:39.8020859Z test resting::tests::rest_record_round_trips_with_anchor_discipline ... ok
2026-07-31T06:01:39.8178621Z test resting::tests::suspend_with_broker_liveness_hint_edges_instead_of_no_edge ... ok
2026-07-31T06:01:39.8528048Z test registryhost::tests::advertisement_carries_the_presence_datum ... ok
2026-07-31T06:01:39.9594496Z test registryhost::tests::advertisement_follows_resting_transitions_epoch_bumped ... ok
2026-07-31T06:01:39.9841988Z test registryhost::tests::erased_perch_is_advertised_offline_not_left_active ... ok
2026-07-31T06:01:39.9842524Z test seedproofx::grace_tests::grade_truth_table ... ok
2026-07-31T06:01:39.9844123Z test seedproofx::grace_tests::seed_never_appears_in_roster_gossip ... ok
2026-07-31T06:01:39.9845974Z test seedproofx::grace_tests::seedxfer_frame_round_trips_and_rejects_malformed ... ok
2026-07-31T06:01:39.9853665Z test seedproofx::roster_tests::admin_seed_rides_as_prefixed_sibling_and_routes_to_its_own_seam ... ok
2026-07-31T06:01:39.9855876Z test seedproofx::roster_tests::empty_roster_frame_round_trips ... ok
2026-07-31T06:01:39.9859379Z test seedproofx::roster_tests::malformed_roster_frame_rejected ... ok
2026-07-31T06:01:39.9863354Z test seedproofx::roster_tests::reconcile_fills_absent_keeps_observed_and_skips_self ... ok
2026-07-31T06:01:39.9870375Z test seedproofx::roster_tests::reconcile_refuses_mismatch_and_repairs_invalid_rows ... ok
2026-07-31T06:01:39.9872569Z test seedproofx::roster_tests::reconcile_replaces_a_suspect_row_with_the_validated_roster_address ... ok
2026-07-31T06:01:39.9874880Z test seedproofx::roster_tests::roster_frame_round_trips ... ok
2026-07-31T06:01:40.0222705Z test registryhost::tests::evict_silent_peers_never_touches_own_rows ... ok
2026-07-31T06:01:40.0224258Z test service::tests::plan_start_prefers_service_then_spawn_idempotent ... ok
2026-07-31T06:01:40.0227397Z test service::tests::plan_stop_routes_managed_then_ipc_then_noop ... ok
2026-07-31T06:01:40.0227970Z test service::tests::run_refused_only_when_windows_and_vanishing ... ok
2026-07-31T06:01:40.0229480Z test service::tests::stale_bare_logon_action_classification ... ok
2026-07-31T06:01:40.1118357Z test projwriter::tests::batched_complexity_counters_hold ... ok
2026-07-31T06:01:40.1141776Z test registryhost::tests::the_engine_room_is_absent_from_the_advertisement_until_it_chooses_a_viewer ... ok
2026-07-31T06:01:40.1143256Z test servicehost::tests::a_healthy_run_resets_the_fast_exit_counter ... ok
2026-07-31T06:01:40.1147570Z test registryhost::tests::recent_projects_for_dedups_newest_first_excludes_owlery ... ok
2026-07-31T06:01:40.2927759Z test relay::tests::relay_backlog_never_drains_active_only ... ok
2026-07-31T06:01:40.2938297Z test servicehost::tests::a_newer_daemons_status_row_degrades_instead_of_failing_the_whole_reply ... ok
2026-07-31T06:01:40.3399999Z test servicehost::tests::a_path_verified_orphan_is_reaped_and_confirmed_by_a_post_kill_read ... ok
2026-07-31T06:01:40.3739515Z test servicehost::tests::a_service_that_exits_instantly_latches_and_stops_relaunching ... ok
2026-07-31T06:01:40.5022986Z test relay::tests::respawn_loses_no_spooled_message ... ok
2026-07-31T06:01:40.6520709Z test relay::tests::run_honors_stop ... ok
2026-07-31T06:01:40.7403950Z test resting::tests::daemon_rest_event_arms_gate_at_rest_edge_only ... ok
2026-07-31T06:01:41.0350191Z test resting::tests::rest_edges_cascade_shells_with_divergence ... ok
2026-07-31T06:01:41.2294937Z test servicehost::tests::a_startup_fault_carries_what_the_service_said_before_it_died ... ok
2026-07-31T06:01:45.6884479Z test servicehost::tests::a_silent_daemon_times_the_caller_out_instead_of_wedging_it ... ok
2026-07-31T06:01:48.0984137Z test seedmap::tests::put_refreshes_existing ... ok
2026-07-31T06:01:48.1081622Z test seedmap::tests::put_then_take_consumes_once ... ok
2026-07-31T06:01:49.9106819Z test seedmap::tests::request_stop_barrier_holds_until_no_listener ... ok
2026-07-31T06:01:50.0337526Z test seedmap::tests::stop_op_acks_then_serve_returns ... ok
2026-07-31T06:01:50.0457560Z test servicehost::tests::adapter_dir_substitutes_as_one_argv_element_even_with_spaces ... ok
2026-07-31T06:01:50.0470654Z test seedmap::tests::take_absent_is_none ... ok
2026-07-31T06:01:50.0932304Z test servicehost::tests::a_stop_kills_the_child_and_re_reads_liveness_after_the_kill ... ok
2026-07-31T06:01:50.0958784Z test serveprobe::tests::is_serving_subnet_honors_membership_and_detach ... ok
2026-07-31T06:01:50.1008638Z test servicehost::tests::a_bind_service_defers_at_boot_and_starts_at_its_bind ... ok
2026-07-31T06:01:50.1204478Z test servicehost::tests::an_orphan_whose_image_cannot_be_verified_is_reported_not_killed ... ok
2026-07-31T06:01:50.1205467Z test servicehost::tests::an_orphan_pid_running_a_different_image_is_never_killed ... ok
2026-07-31T06:01:50.1210151Z test servicehost::tests::backoff_doubles_and_saturates ... ok
2026-07-31T06:01:50.1213593Z test servicehost::tests::consecutive_fast_exits_latch_startup_fault_early ... ok
2026-07-31T06:01:50.1230047Z test servicehost::tests::empty_and_dead_orphan_records_read_apart ... ok
2026-07-31T06:01:50.1232323Z test servicehost::tests::hold_outranks_everything ... ok
2026-07-31T06:01:50.1234339Z test servicehost::tests::only_the_three_ruled_opportunities_clear_the_latch ... ok
2026-07-31T06:01:50.1237750Z test servicehost::tests::quiesce_engages_the_hold_before_placing_the_stop_marker ... ok
2026-07-31T06:01:50.1250078Z test projwriter::tests::parity_full_ordered_list_vs_legacy_oracle ... ok
2026-07-31T06:01:50.1252632Z test servicehost::tests::slow_crashes_latch_the_ordinary_give_up_not_startup_fault ... ok
2026-07-31T06:01:50.1254061Z test servicehost::tests::start_trigger_decides_which_opportunities_start_it ... ok
2026-07-31T06:01:50.1350344Z test servicehost::tests::ensure_supervised_is_one_instance_per_option_and_refuses_an_unclear_sweep ... ok
2026-07-31T06:01:50.3147703Z test servicehost::tests::an_exit_under_an_engaged_hold_stands_down_quiesced_instead_of_latching ... ok
2026-07-31T06:01:50.3270150Z test servicehost::tests::a_boot_service_starts_once_and_the_next_sweep_reads_already_running ... ok
2026-07-31T06:01:50.8307950Z test servicehost::tests::a_held_option_is_refused_by_a_clearing_sweep_and_starts_only_when_the_hold_releases ... ok
2026-07-31T06:01:50.8319176Z test servicehost::tests::the_service_command_resolves_its_program_through_the_install_dir_helper ... ok
2026-07-31T06:01:50.8321210Z test servicehost::tests::the_service_spawn_scrubs_the_session_identity_env ... ok
2026-07-31T06:01:50.8327596Z test servicehost::tests::the_spawn_environment_carries_the_cli_capability ... ok
2026-07-31T06:01:50.8329568Z test servicehost::tests::the_spawn_environment_carries_the_per_option_identity ... ok
2026-07-31T06:01:51.0635857Z test servicehost::tests::a_latched_option_reports_the_captured_evidence_behind_its_latch ... ok
2026-07-31T06:01:51.3019013Z test servicehost::tests::a_service_that_exits_on_the_stop_marker_quiesces_cooperatively ... ok
2026-07-31T06:01:51.4342898Z test servicehost::tests::the_startup_capture_is_reclaimed_once_the_run_proves_it_starts ... ok
2026-07-31T06:01:51.4344418Z test shellchan::tests::activity_frame_parses_back_through_the_public_decoder ... ok
2026-07-31T06:01:51.4345944Z test shellchan::tests::activity_frame_shape_is_the_published_one ... ok
2026-07-31T06:01:51.4347277Z test shellchan::tests::drive_frame_shape_mirrors_sensory ... ok
2026-07-31T06:01:51.4352754Z test shellchan::tests::frames_compose_and_stamp_roundtrips ... ok
2026-07-31T06:01:51.5694013Z test shellchan::tests::restamp_carries_pending_rows_across_rotation ... ok
2026-07-31T06:01:51.5695613Z test shellchan::tests::sensory_text_file_frames_shape ... ok
2026-07-31T06:01:51.5699827Z test shellchan::tests::vocab_check_bounds_ops_and_args ... ok
2026-07-31T06:01:51.5869886Z test shelldisc::tests::discover_across_joins_other_node_subnet_adapters ... ok
2026-07-31T06:01:51.6210850Z test shelldisc::tests::discovery_lists_a_dead_pid_instance_offline ... ok
2026-07-31T06:01:51.6884126Z test shelldisc::tests::discovery_own_plus_broadcast_gated_instantiable ... ok
2026-07-31T06:01:51.6898314Z test servicehost::tests::a_service_that_ignores_the_stop_marker_is_force_killed_and_confirmed_dead ... ok
2026-07-31T06:01:51.6901661Z test shellhost::tests::a_daemon_that_launches_is_the_only_launcher ... ok
2026-07-31T06:01:51.6905033Z test shellhost::tests::a_late_ack_loser_adopts_the_winner_instead_of_spawning ... ok
2026-07-31T06:01:51.6908333Z test shellhost::tests::a_post_ack_failure_never_spawns_again ... ok
2026-07-31T06:01:51.6910165Z test servicehost::tests::a_soft_deregistered_adapters_service_never_starts_in_the_first_place ... ok
2026-07-31T06:01:51.6911702Z test shellhost::tests::a_post_ack_silence_is_indeterminate_not_failure ... ok
2026-07-31T06:01:51.6915716Z test shellhost::tests::a_pre_ack_refusal_falls_back_in_process ... ok
2026-07-31T06:01:51.6926375Z test servicehost::tests::a_status_read_mints_no_hold_flag_for_the_option_it_reports ... ok
2026-07-31T06:01:51.6931052Z test shellhost::tests::an_answered_refusal_never_consults_the_arbiter ... ok
2026-07-31T06:01:51.6942537Z test shellhost::tests::an_unserved_socket_is_a_pre_ack_refusal ... ok
2026-07-31T06:01:51.6996818Z test shellhost::tests::a_spawn_template_resolves_its_program_and_adapter_dir_against_the_install_dir ... ok
2026-07-31T06:01:51.7130298Z test shelldisc::tests::shell_context_renders_sections_and_empties_to_none ... ok
2026-07-31T06:01:51.7696896Z test shellhost::tests::a_spawn_program_the_install_dir_does_not_ship_falls_through_to_path ... ok
2026-07-31T06:01:51.8887426Z test shellhost::tests::gateway_typed_owner_spawns_and_owns_a_shell ... ok
2026-07-31T06:01:52.0148366Z test shellhost::tests::launch_fails_closed_on_bad_templates ... ok
2026-07-31T06:01:52.0752073Z test servicehost::tests::a_stood_down_supervisors_latch_outlives_its_thread_and_suppresses_the_next_sweep ... ok
2026-07-31T06:01:52.0753840Z test shellhost::tests::link_key_and_frame_mac_roundtrip ... ok
2026-07-31T06:01:52.0819663Z test shellhost::tests::only_a_live_recorded_pid_wins_a_launch_race ... ok
2026-07-31T06:01:52.0823438Z test shellhost::tests::only_the_relay_receipt_routes_through_the_daemon ... ok
2026-07-31T06:01:52.0857580Z test shellhost::tests::spawn_template_perch_dir_fills_as_one_argv_element ... ok
2026-07-31T06:01:52.0937758Z test shellhost::tests::spawn_template_without_perch_dir_is_unchanged ... ok
2026-07-31T06:01:52.0940464Z test shellhost::tests::the_arbiter_does_not_block_an_uncontested_fallback ... ok
2026-07-31T06:01:52.0953682Z test shellwake::tests::a_wake_template_resolves_its_program_and_adapter_dir_against_the_install_dir ... ok
2026-07-31T06:01:52.0954956Z test shellwake::tests::backoff_curve_doubles_to_the_cap ... ok
2026-07-31T06:01:52.3740437Z test shellhost::tests::close_shell_ephemeral_tears_down_and_frees_the_slot ... ok
2026-07-31T06:01:52.4062380Z test shellwake::tests::reconcile_never_adopts_a_stale_online_instance ... ok
2026-07-31T06:01:52.4376618Z test shellwake::tests::reconcile_resolves_profile_overlay ... ok
2026-07-31T06:01:53.0717140Z test servicehost::tests::a_supervised_option_no_longer_declared_still_appears_as_undeclared ... ok
2026-07-31T06:01:53.0991304Z test shellwake::tests::resolve_wake_refuses_without_a_reachable_owner ... ok
2026-07-31T06:01:53.2167402Z test shellhost::tests::launch_parks_token_and_bind_by_token_onlines ... ok
2026-07-31T06:01:53.2180264Z test shellwake::tests::the_wake_catalog_shares_the_spawn_vocabulary_but_is_not_the_same_set ... ok
2026-07-31T06:01:53.3406740Z test shellwake::tests::resolve_wake_leaves_a_dormant_owner_and_relaunches ... ok
2026-07-31T06:01:53.3451629Z test servicehost::tests::a_supervisor_whose_declaration_is_gone_is_torn_down_by_the_next_sweep ... ok
2026-07-31T06:01:53.3870552Z test servicehost::tests::an_adapter_scoped_sweep_neither_starts_nor_stops_another_adapters_service ... ok
2026-07-31T06:01:53.4079853Z test stderrlog::tests::roll_keeps_bounded_generations_and_preserves_current ... ok
2026-07-31T06:01:53.4116064Z test stderrlog::tests::roll_with_keep_one_clears_without_backup ... ok
2026-07-31T06:01:53.4169670Z test servicehost::tests::an_unknown_op_closes_the_connection_instead_of_wedging_the_caller ... ok
2026-07-31T06:01:53.4197197Z test sync::tests::gate_decision_table ... ok
2026-07-31T06:01:53.4197538Z test stderrlog::tests::should_roll_at_or_over_cap_only ... ok
2026-07-31T06:01:53.4227311Z test servicehost::tests::quiesce_raises_the_hold_before_it_can_place_any_stop_marker ... ok
2026-07-31T06:01:53.4462700Z test servicehost::tests::the_advisory_line_is_read_bounded_and_never_dressed_up_when_absent ... ok
2026-07-31T06:01:53.4463548Z test translation::tests::inject_floor_buffers_while_held_then_drains_in_order ... ok
2026-07-31T06:01:53.4475398Z test translation::tests::key_cmd_parses_each_wire_shape ... ok
2026-07-31T06:01:53.4485287Z test translation::tests::key_to_bytes_send_keys_map ... ok
2026-07-31T06:01:53.4529979Z test translation::tests::to_binary_serializes_to_wire_and_input_is_content_free ... ok
2026-07-31T06:01:53.4547018Z test transport::tests::local_socket_handshake_and_frame_round_trip ... ok
2026-07-31T06:01:53.4557186Z test transport::tests::local_socket_rejects_wrong_role ... ok
2026-07-31T06:01:53.4560585Z test tunnelhub::tests::clear_evicts_the_entry ... ok
2026-07-31T06:01:53.4564574Z test tunnelhub::tests::dead_generation_stream_is_never_surfaced ... ok
2026-07-31T06:01:53.4567028Z test tunnelhub::tests::entries_are_per_owner ... ok
2026-07-31T06:01:53.4569779Z test tunnelhub::tests::relink_overwrites_the_entry_with_a_fresh_generation ... ok
2026-07-31T06:01:53.4579807Z test tunnelhub::tests::resolve_serves_each_end_under_the_opening_token ... ok
2026-07-31T06:01:53.4589587Z test update::tests::apply_refuses_non_brain_only_plan ... ok
2026-07-31T06:01:53.4590223Z test update::tests::classify_brain_only_when_broker_hosts_new_brain ... ok
2026-07-31T06:01:53.4594110Z test update::tests::classify_broker_breaking_on_resource_abi_change ... ok
2026-07-31T06:01:53.4596971Z test update::tests::classify_broker_compatible_when_brain_below_floor ... ok
2026-07-31T06:01:53.4822808Z test shellwake::tests::watcher_opcode_exit_fires_resolution_once ... ok
2026-07-31T06:01:53.4835616Z test update::tests::plan_verified_produces_no_plan_for_a_rejected_release ... ok
2026-07-31T06:01:53.4915818Z test update::tests::plan_verified_yields_a_plan_for_a_valid_release ... ok
2026-07-31T06:01:53.5104875Z test shellwake::tests::reconcile_flips_watchers_with_instance_state ... ok
2026-07-31T06:01:53.5105421Z test shellhost::tests::close_shell_delivers_pre_close_then_kills_and_flips_offline ... ok
2026-07-31T06:01:53.5106181Z test wan::tests::origin_user_backed_matrix ... ok
2026-07-31T06:01:53.5107854Z test wan::tests::wan_ingress_empty_from_renders_origin_node_label ... ok
2026-07-31T06:01:53.5109403Z test wan::tests::wan_outcome_token_round_trips_and_unknown_is_noreply ... ok
2026-07-31T06:01:53.5111192Z test wan::tests::wan_user_msg_restamped_unless_origin_user_backed ... ok
2026-07-31T06:01:53.5131310Z test update::tests::plan_verified_update_set_uses_selected_platform_spec ... ok
2026-07-31T06:01:53.5131951Z test xfer::tests::resolve_under_confines_to_root ... ok
2026-07-31T06:01:53.5165907Z test shellhost::tests::close_shell_dead_child_is_prompt_and_manifestless_never_erases ... ok
2026-07-31T06:01:53.5277730Z test xfer::tests::recv_state_chunks_idempotent_and_commit_replays_safely ... ok
2026-07-31T06:01:53.6988716Z test translation::tests::flagged_spawn_still_starts ... ok
2026-07-31T06:01:53.8329947Z test servicehost::tests::the_hold_outlives_the_force_killed_supervision_it_ended ... ok
2026-07-31T06:01:54.0748980Z test servicehost::tests::the_projection_reports_a_live_supervisor_with_its_declaration_and_advisory ... ok
2026-07-31T06:01:54.0749858Z test servicehost::tests::the_projection_scopes_to_one_adapter_and_keeps_deregistered_declarations ... ok
2026-07-31T06:01:54.0907572Z test servicehost::tests::the_status_op_reports_over_the_wire_and_starts_nothing ... ok
2026-07-31T06:01:54.2352622Z test shellwake::tests::watcher_crash_exits_respawn_then_give_up ... ok
2026-07-31T06:01:54.5603025Z test servicehost::tests::the_stop_marker_is_never_visible_before_the_hold_is_up ... ok
2026-07-31T06:01:55.0846745Z test shellwake::tests::resolve_wake_revives_a_suspended_owner_without_double_launch ... ok
2026-07-31T06:01:55.0851539Z test stderrlog::tests::path_under_home_and_stamp_is_legible ... ok
2026-07-31T06:01:55.2199512Z test wan::tests::no_binary_wan_arrival_spools_not_pty ... ok
2026-07-31T06:01:55.2285238Z test wan::tests::the_stamp_not_the_from_is_the_sender_subject ... ok
2026-07-31T06:01:57.3817384Z test sync::tests::reconcile_driver_structurally_excludes_live_role ... ok
2026-07-31T06:01:57.9895366Z test sync::tests::select_refs_scopes_two_tiers ... ok
2026-07-31T06:01:57.9895644Z 
2026-07-31T06:01:57.9895712Z failures:
2026-07-31T06:01:57.9895820Z 
2026-07-31T06:01:57.9895976Z ---- psyrelay::tests::notify_reaches_own_user_only stdout ----
2026-07-31T06:01:57.9896222Z 
2026-07-31T06:01:57.9896553Z thread 'psyrelay::tests::notify_reaches_own_user_only' (8700) panicked at crates\spt-daemon\src\psyrelay.rs:382:13:
2026-07-31T06:01:57.9897033Z assertion `left == right` failed
2026-07-31T06:01:57.9897831Z   left: DrainedMsg { from: "doyle-psyche", body: "<EVENT type=\"notify\" from=\"doyle-psyche\" notif_id=\"cafe:2\" subnet=\"home\">build done<br>all green</EVENT>" }
2026-07-31T06:01:57.9898649Z  right: DrainedMsg { from: "doyle-psyche", body: "<EVENT type=\"notify\" from=\"doyle-psyche\" notif_id=\"cafe:1\" subnet=\"home\">build done<br>all green</EVENT>" }
2026-07-31T06:01:57.9899199Z 
2026-07-31T06:01:57.9899203Z 
2026-07-31T06:01:57.9899276Z failures:
2026-07-31T06:01:57.9899433Z     psyrelay::tests::notify_reaches_own_user_only
2026-07-31T06:01:57.9899561Z 
2026-07-31T06:01:57.9899733Z test result: FAILED. 722 passed; 1 failed; 0 ignored; 0 measured; 0 filtered out; finished in 86.89s
2026-07-31T06:01:57.9899951Z 
2026-07-31T06:01:57.9964494Z error: test failed, to rerun pass `-p spt-daemon --lib`
2026-07-31T06:01:58.0624664Z ##[error]Process completed with exit code 1.
2026-07-31T06:01:58.1666702Z Post job cleanup.
2026-07-31T06:01:58.4641306Z [command]"C:\Program Files\Git\cmd\git.exe" version
2026-07-31T06:01:58.4923487Z git version 2.43.0.windows.1
2026-07-31T06:01:58.4965124Z Copying 'C:\Users\decid\.gitconfig' to 'C:\actions-runner\_work\_temp\8eb89e9b-6eae-48dc-9309-daf224164e30\.gitconfig'
2026-07-31T06:01:58.4979852Z Temporarily overriding HOME='C:\actions-runner\_work\_temp\8eb89e9b-6eae-48dc-9309-daf224164e30' before making global git config changes
2026-07-31T06:01:58.4980370Z Adding repository directory to the temporary git global config as a safe directory
2026-07-31T06:01:58.4985597Z [command]"C:\Program Files\Git\cmd\git.exe" config --global --add safe.directory C:\actions-runner\_work\spt-bs-core\spt-bs-core
2026-07-31T06:01:58.5283102Z [command]"C:\Program Files\Git\cmd\git.exe" config --local --name-only --get-regexp core\.sshCommand
2026-07-31T06:01:58.5563954Z [command]"C:\Program Files\Git\cmd\git.exe" submodule foreach --recursive "sh -c \"git config --local --name-only --get-regexp 'core\.sshCommand' && git config --local --unset-all 'core.sshCommand' || :\""
2026-07-31T06:01:59.1841014Z [command]"C:\Program Files\Git\cmd\git.exe" config --local --name-only --get-regexp http\.https\:\/\/github\.com\/\.extraheader
2026-07-31T06:01:59.2100056Z http.https://github.com/.extraheader
2026-07-31T06:01:59.2125508Z [command]"C:\Program Files\Git\cmd\git.exe" config --local --unset-all http.https://github.com/.extraheader
2026-07-31T06:01:59.2430496Z [command]"C:\Program Files\Git\cmd\git.exe" submodule foreach --recursive "sh -c \"git config --local --name-only --get-regexp 'http\.https\:\/\/github\.com\/\.extraheader' && git config --local --unset-all 'http.https://github.com/.extraheader' || :\""
2026-07-31T06:02:00.0736370Z [command]"C:\Program Files\Git\cmd\git.exe" config --local --name-only --get-regexp ^includeIf\.gitdir:
2026-07-31T06:02:00.1029582Z [command]"C:\Program Files\Git\cmd\git.exe" submodule foreach --recursive "git config --local --show-origin --name-only --get-regexp remote.origin.url"
2026-07-31T06:02:00.7575891Z Cleaning up orphan processes
2026-07-31T06:02:00.7904441Z Terminate orphan process: pid (51292) (PING)
2026-07-31T06:02:00.7936668Z Terminate orphan process: pid (34908) (PING)
